diff mbox

[v3,0/3] Fix ldc.

Message ID 87bn01l38x.fsf@gnu.org
State New
Headers show

Commit Message

Roel Janssen Sept. 6, 2016, 10:41 a.m. UTC
;;; note: source file /home/roel/.config/guix/latest/gnu/packages/ldc.scm
;;;       newer than compiled /home/roel/.config/guix/latest/gnu/packages/ldc.go
@ build-started /gnu/store/bzgm6da3bv9s6q6bm56ng7fsdhbxxpvr-ldc-0.17.1.drv - x86_64-linux /usr/local/var/log/guix/drvs/bz//gm6da3bv9s6q6bm56ng7fsdhbxxpvr-ldc-0.17.1.drv.bz2
starting phase `set-SOURCE-DATE-EPOCH'
phase `set-SOURCE-DATE-EPOCH' succeeded after 0.0 seconds
starting phase `set-paths'
environment variable `PATH' set to `/gnu/store/zcn7lm8lf60q0756q7z9qpvl9z5wbh82-cmake-3.5.2/bin:/gnu/store/2ycqrc4r56r5ww8ja8x4gz25qsp65v65-llvm-3.7.1/bin:/gnu/store/560fia642sb7am6f7mamgxkd8pkp1iv0-clang-3.7.1/bin:/gnu/store/xfphprw3fib30w373h3in6cmhs9081xm-unzip-6.0/bin:/gnu/store/wa1yc835mb7pmmrj45xfgviqr5fbasqq-python-wrapper-3.4.3/bin:/gnu/store/687ynwbyr4vsqrs9qinhzwmb6yp6bm71-python-lit-0.5.0/bin:/gnu/store/2pdb9h9mdq7qnjj1b9b6k2a2md46idyj-tar-1.29/bin:/gnu/store/54ilw1jcicj7n259cpra59y6gik2mig2-gzip-1.8/bin:/gnu/store/pzk986yikywnql4x393pbhzbiz7vl72n-bzip2-1.0.6/bin:/gnu/store/p9c6hk9rdln5rz752fkwd6zxj2xs3sa9-xz-5.2.2/bin:/gnu/store/3nhg61n6p870vj1q654rbxrgsq5zsgsp-file-5.25/bin:/gnu/store/lr2vwc88wck5ra3p969rgk8nnqh111aj-diffutils-3.3/bin:/gnu/store/ni491r4ffm03v0cr70df12lwiq826das-patch-2.7.5/bin:/gnu/store/bzv2l4hx3j74jm49fb7g20900yqjdn22-sed-4.2.2/bin:/gnu/store/53p06lrr734a1xxa770xz9ddan4a2zjq-findutils-4.6.0/bin:/gnu/store/bd4m0d7h247iwwgl7wi3b28prv554gjn-gawk-4.1.3/bin:/gnu/store/dk9hvkwr5s4n22z9pjgcmxrppd08k286-grep-2.25/bin:/gnu/store/lpvkjic9dhj55plc29jhq8l39irvqm4f-coreutils-8.25/bin:/gnu/store/1iiqn2124niw1pvqfwr7wb3lxi28r67q-make-4.2/bin:/gnu/store/ykzwykkvr2c80rw4l1qh3mvfdkl7jibi-bash-4.3.42/bin:/gnu/store/5k8z2aj8ca16nmvwvdsl0mdc3slm14k2-ld-wrapper-0/bin:/gnu/store/z53lxlrp7061vggbnhpxcsmad6lx96p8-binutils-2.25.1/bin:/gnu/store/frrj3bfbmg5vrd0flh9cf8j64h7cr2v4-gcc-4.9.3/bin:/gnu/store/m9vxvhdj691bq1f85lpflvnhcvrdilih-glibc-2.23/bin:/gnu/store/m9vxvhdj691bq1f85lpflvnhcvrdilih-glibc-2.23/sbin:/gnu/store/m4gc2wx4q9if1vrhgclpspdil7rqsn21-python-3.4.3/bin'
environment variable `CMAKE_PREFIX_PATH' set to `/gnu/store/zcn7lm8lf60q0756q7z9qpvl9z5wbh82-cmake-3.5.2/:/gnu/store/2ycqrc4r56r5ww8ja8x4gz25qsp65v65-llvm-3.7.1/:/gnu/store/560fia642sb7am6f7mamgxkd8pkp1iv0-clang-3.7.1/:/gnu/store/xfphprw3fib30w373h3in6cmhs9081xm-unzip-6.0/:/gnu/store/wa1yc835mb7pmmrj45xfgviqr5fbasqq-python-wrapper-3.4.3/:/gnu/store/687ynwbyr4vsqrs9qinhzwmb6yp6bm71-python-lit-0.5.0/:/gnu/store/1v4anv1dwvskkav1zj08gicwaibachr1-libconfig-1.5/:/gnu/store/cpk7xhgvpgw39xcciya6a2s0126ashp8-libedit-20150325-3.1/:/gnu/store/0mkxmwcykgz7dknap50wn4nfhh0kl8j4-tzdata-2015g/:/gnu/store/5992iq1v7arqa14ym3di58n4la0893nv-zlib-1.2.8/:/gnu/store/2pdb9h9mdq7qnjj1b9b6k2a2md46idyj-tar-1.29/:/gnu/store/54ilw1jcicj7n259cpra59y6gik2mig2-gzip-1.8/:/gnu/store/pzk986yikywnql4x393pbhzbiz7vl72n-bzip2-1.0.6/:/gnu/store/p9c6hk9rdln5rz752fkwd6zxj2xs3sa9-xz-5.2.2/:/gnu/store/3nhg61n6p870vj1q654rbxrgsq5zsgsp-file-5.25/:/gnu/store/lr2vwc88wck5ra3p969rgk8nnqh111aj-diffutils-3.3/:/gnu/store/ni491r4ffm03v0cr70df12lwiq826das-patch-2.7.5/:/gnu/store/bzv2l4hx3j74jm49fb7g20900yqjdn22-sed-4.2.2/:/gnu/store/53p06lrr734a1xxa770xz9ddan4a2zjq-findutils-4.6.0/:/gnu/store/bd4m0d7h247iwwgl7wi3b28prv554gjn-gawk-4.1.3/:/gnu/store/dk9hvkwr5s4n22z9pjgcmxrppd08k286-grep-2.25/:/gnu/store/lpvkjic9dhj55plc29jhq8l39irvqm4f-coreutils-8.25/:/gnu/store/1iiqn2124niw1pvqfwr7wb3lxi28r67q-make-4.2/:/gnu/store/ykzwykkvr2c80rw4l1qh3mvfdkl7jibi-bash-4.3.42/:/gnu/store/5k8z2aj8ca16nmvwvdsl0mdc3slm14k2-ld-wrapper-0/:/gnu/store/z53lxlrp7061vggbnhpxcsmad6lx96p8-binutils-2.25.1/:/gnu/store/frrj3bfbmg5vrd0flh9cf8j64h7cr2v4-gcc-4.9.3/:/gnu/store/m9vxvhdj691bq1f85lpflvnhcvrdilih-glibc-2.23/:/gnu/store/w74j2phxh04phnspxmjg9hpzpk90054x-glibc-utf8-locales-2.23/:/gnu/store/3wbcqds648qx0jak9nbbgjfybrdsnryk-clang-runtime-3.7.1/:/gnu/store/m4gc2wx4q9if1vrhgclpspdil7rqsn21-python-3.4.3/:/gnu/store/k3nwrfrgkg1bafhqi9w8inh2rr8njb1b-linux-libre-headers-4.1.18/'
environment variable `CPATH' set to `/gnu/store/2ycqrc4r56r5ww8ja8x4gz25qsp65v65-llvm-3.7.1/include:/gnu/store/560fia642sb7am6f7mamgxkd8pkp1iv0-clang-3.7.1/include:/gnu/store/1v4anv1dwvskkav1zj08gicwaibachr1-libconfig-1.5/include:/gnu/store/cpk7xhgvpgw39xcciya6a2s0126ashp8-libedit-20150325-3.1/include:/gnu/store/5992iq1v7arqa14ym3di58n4la0893nv-zlib-1.2.8/include:/gnu/store/pzk986yikywnql4x393pbhzbiz7vl72n-bzip2-1.0.6/include:/gnu/store/p9c6hk9rdln5rz752fkwd6zxj2xs3sa9-xz-5.2.2/include:/gnu/store/3nhg61n6p870vj1q654rbxrgsq5zsgsp-file-5.25/include:/gnu/store/bd4m0d7h247iwwgl7wi3b28prv554gjn-gawk-4.1.3/include:/gnu/store/1iiqn2124niw1pvqfwr7wb3lxi28r67q-make-4.2/include:/gnu/store/z53lxlrp7061vggbnhpxcsmad6lx96p8-binutils-2.25.1/include:/gnu/store/frrj3bfbmg5vrd0flh9cf8j64h7cr2v4-gcc-4.9.3/include:/gnu/store/m9vxvhdj691bq1f85lpflvnhcvrdilih-glibc-2.23/include:/gnu/store/3wbcqds648qx0jak9nbbgjfybrdsnryk-clang-runtime-3.7.1/include:/gnu/store/m4gc2wx4q9if1vrhgclpspdil7rqsn21-python-3.4.3/include:/gnu/store/k3nwrfrgkg1bafhqi9w8inh2rr8njb1b-linux-libre-headers-4.1.18/include'
environment variable `LIBRARY_PATH' set to `/gnu/store/2ycqrc4r56r5ww8ja8x4gz25qsp65v65-llvm-3.7.1/lib:/gnu/store/560fia642sb7am6f7mamgxkd8pkp1iv0-clang-3.7.1/lib:/gnu/store/687ynwbyr4vsqrs9qinhzwmb6yp6bm71-python-lit-0.5.0/lib:/gnu/store/1v4anv1dwvskkav1zj08gicwaibachr1-libconfig-1.5/lib:/gnu/store/cpk7xhgvpgw39xcciya6a2s0126ashp8-libedit-20150325-3.1/lib:/gnu/store/5992iq1v7arqa14ym3di58n4la0893nv-zlib-1.2.8/lib:/gnu/store/pzk986yikywnql4x393pbhzbiz7vl72n-bzip2-1.0.6/lib:/gnu/store/p9c6hk9rdln5rz752fkwd6zxj2xs3sa9-xz-5.2.2/lib:/gnu/store/3nhg61n6p870vj1q654rbxrgsq5zsgsp-file-5.25/lib:/gnu/store/bd4m0d7h247iwwgl7wi3b28prv554gjn-gawk-4.1.3/lib:/gnu/store/z53lxlrp7061vggbnhpxcsmad6lx96p8-binutils-2.25.1/lib:/gnu/store/m9vxvhdj691bq1f85lpflvnhcvrdilih-glibc-2.23/lib:/gnu/store/w74j2phxh04phnspxmjg9hpzpk90054x-glibc-utf8-locales-2.23/lib:/gnu/store/3wbcqds648qx0jak9nbbgjfybrdsnryk-clang-runtime-3.7.1/lib:/gnu/store/m4gc2wx4q9if1vrhgclpspdil7rqsn21-python-3.4.3/lib'
environment variable `PYTHONPATH' set to `/gnu/store/687ynwbyr4vsqrs9qinhzwmb6yp6bm71-python-lit-0.5.0/lib/python3.4/site-packages:/gnu/store/m4gc2wx4q9if1vrhgclpspdil7rqsn21-python-3.4.3/lib/python3.4/site-packages'
environment variable `C_INCLUDE_PATH' set to `/gnu/store/2ycqrc4r56r5ww8ja8x4gz25qsp65v65-llvm-3.7.1/include:/gnu/store/560fia642sb7am6f7mamgxkd8pkp1iv0-clang-3.7.1/include:/gnu/store/1v4anv1dwvskkav1zj08gicwaibachr1-libconfig-1.5/include:/gnu/store/cpk7xhgvpgw39xcciya6a2s0126ashp8-libedit-20150325-3.1/include:/gnu/store/5992iq1v7arqa14ym3di58n4la0893nv-zlib-1.2.8/include:/gnu/store/pzk986yikywnql4x393pbhzbiz7vl72n-bzip2-1.0.6/include:/gnu/store/p9c6hk9rdln5rz752fkwd6zxj2xs3sa9-xz-5.2.2/include:/gnu/store/3nhg61n6p870vj1q654rbxrgsq5zsgsp-file-5.25/include:/gnu/store/bd4m0d7h247iwwgl7wi3b28prv554gjn-gawk-4.1.3/include:/gnu/store/1iiqn2124niw1pvqfwr7wb3lxi28r67q-make-4.2/include:/gnu/store/z53lxlrp7061vggbnhpxcsmad6lx96p8-binutils-2.25.1/include:/gnu/store/frrj3bfbmg5vrd0flh9cf8j64h7cr2v4-gcc-4.9.3/include:/gnu/store/m9vxvhdj691bq1f85lpflvnhcvrdilih-glibc-2.23/include:/gnu/store/3wbcqds648qx0jak9nbbgjfybrdsnryk-clang-runtime-3.7.1/include:/gnu/store/m4gc2wx4q9if1vrhgclpspdil7rqsn21-python-3.4.3/include:/gnu/store/k3nwrfrgkg1bafhqi9w8inh2rr8njb1b-linux-libre-headers-4.1.18/include'
environment variable `CPLUS_INCLUDE_PATH' set to `/gnu/store/2ycqrc4r56r5ww8ja8x4gz25qsp65v65-llvm-3.7.1/include:/gnu/store/560fia642sb7am6f7mamgxkd8pkp1iv0-clang-3.7.1/include:/gnu/store/1v4anv1dwvskkav1zj08gicwaibachr1-libconfig-1.5/include:/gnu/store/cpk7xhgvpgw39xcciya6a2s0126ashp8-libedit-20150325-3.1/include:/gnu/store/5992iq1v7arqa14ym3di58n4la0893nv-zlib-1.2.8/include:/gnu/store/pzk986yikywnql4x393pbhzbiz7vl72n-bzip2-1.0.6/include:/gnu/store/p9c6hk9rdln5rz752fkwd6zxj2xs3sa9-xz-5.2.2/include:/gnu/store/3nhg61n6p870vj1q654rbxrgsq5zsgsp-file-5.25/include:/gnu/store/bd4m0d7h247iwwgl7wi3b28prv554gjn-gawk-4.1.3/include:/gnu/store/1iiqn2124niw1pvqfwr7wb3lxi28r67q-make-4.2/include:/gnu/store/z53lxlrp7061vggbnhpxcsmad6lx96p8-binutils-2.25.1/include:/gnu/store/frrj3bfbmg5vrd0flh9cf8j64h7cr2v4-gcc-4.9.3/include:/gnu/store/m9vxvhdj691bq1f85lpflvnhcvrdilih-glibc-2.23/include:/gnu/store/3wbcqds648qx0jak9nbbgjfybrdsnryk-clang-runtime-3.7.1/include:/gnu/store/m4gc2wx4q9if1vrhgclpspdil7rqsn21-python-3.4.3/include:/gnu/store/k3nwrfrgkg1bafhqi9w8inh2rr8njb1b-linux-libre-headers-4.1.18/include'
environment variable `GUIX_LOCPATH' set to `/gnu/store/w74j2phxh04phnspxmjg9hpzpk90054x-glibc-utf8-locales-2.23/lib/locale'
phase `set-paths' succeeded after 0.0 seconds
starting phase `install-locale'
using 'en_US.utf8' locale for category "LC_ALL"
phase `install-locale' succeeded after 0.0 seconds
starting phase `unpack'
ldc-0.17.1/
ldc-0.17.1/.clang-format
ldc-0.17.1/.clang-tidy
ldc-0.17.1/.gitmodules
ldc-0.17.1/CMakeCPack.cmake
ldc-0.17.1/CMakeLists.txt
ldc-0.17.1/Doxyfile
ldc-0.17.1/LICENSE
ldc-0.17.1/README.md
ldc-0.17.1/appveyor.yml
ldc-0.17.1/bash_completion.d/
ldc-0.17.1/bash_completion.d/ldc2
ldc-0.17.1/circle.yml
ldc-0.17.1/cmake/
ldc-0.17.1/cmake/Modules/
ldc-0.17.1/cmake/Modules/FindLLVM.cmake
ldc-0.17.1/cmake/Modules/FindLibConfig.cmake
ldc-0.17.1/cmake/Modules/GetGitRevisionDescription.cmake
ldc-0.17.1/cmake/Modules/GetGitRevisionDescription.cmake.in
ldc-0.17.1/cmake/Modules/GetLinuxDistribution.cmake
ldc-0.17.1/dmd2/
ldc-0.17.1/dmd2/access.c
ldc-0.17.1/dmd2/aggregate.h
ldc-0.17.1/dmd2/aliasthis.c
ldc-0.17.1/dmd2/aliasthis.h
ldc-0.17.1/dmd2/apply.c
ldc-0.17.1/dmd2/argtypes.c
ldc-0.17.1/dmd2/arrayop.c
ldc-0.17.1/dmd2/arraytypes.h
ldc-0.17.1/dmd2/artistic.txt
ldc-0.17.1/dmd2/attrib.c
ldc-0.17.1/dmd2/attrib.h
ldc-0.17.1/dmd2/builtin.c
ldc-0.17.1/dmd2/canthrow.c
ldc-0.17.1/dmd2/cast.c
ldc-0.17.1/dmd2/class.c
ldc-0.17.1/dmd2/clone.c
ldc-0.17.1/dmd2/complex_t.h
ldc-0.17.1/dmd2/cond.c
ldc-0.17.1/dmd2/cond.h
ldc-0.17.1/dmd2/constfold.c
ldc-0.17.1/dmd2/cppmangle.c
ldc-0.17.1/dmd2/ctfe.h
ldc-0.17.1/dmd2/ctfeexpr.c
ldc-0.17.1/dmd2/declaration.c
ldc-0.17.1/dmd2/declaration.h
ldc-0.17.1/dmd2/delegatize.c
ldc-0.17.1/dmd2/doc.c
ldc-0.17.1/dmd2/doc.h
ldc-0.17.1/dmd2/dsymbol.c
ldc-0.17.1/dmd2/dsymbol.h
ldc-0.17.1/dmd2/entity.c
ldc-0.17.1/dmd2/enum.c
ldc-0.17.1/dmd2/enum.h
ldc-0.17.1/dmd2/errors.c
ldc-0.17.1/dmd2/errors.h
ldc-0.17.1/dmd2/escape.c
ldc-0.17.1/dmd2/expression.c
ldc-0.17.1/dmd2/expression.h
ldc-0.17.1/dmd2/func.c
ldc-0.17.1/dmd2/globals.c
ldc-0.17.1/dmd2/globals.h
ldc-0.17.1/dmd2/gpl.txt
ldc-0.17.1/dmd2/hdrgen.c
ldc-0.17.1/dmd2/hdrgen.h
ldc-0.17.1/dmd2/identifier.c
ldc-0.17.1/dmd2/identifier.h
ldc-0.17.1/dmd2/idgen.c
ldc-0.17.1/dmd2/impcnvgen.c
ldc-0.17.1/dmd2/imphint.c
ldc-0.17.1/dmd2/import.c
ldc-0.17.1/dmd2/import.h
ldc-0.17.1/dmd2/init.c
ldc-0.17.1/dmd2/init.h
ldc-0.17.1/dmd2/inline.c
ldc-0.17.1/dmd2/interpret.c
ldc-0.17.1/dmd2/intrange.c
ldc-0.17.1/dmd2/intrange.h
ldc-0.17.1/dmd2/json.c
ldc-0.17.1/dmd2/json.h
ldc-0.17.1/dmd2/lexer.c
ldc-0.17.1/dmd2/lexer.h
ldc-0.17.1/dmd2/macro.c
ldc-0.17.1/dmd2/macro.h
ldc-0.17.1/dmd2/mangle.c
ldc-0.17.1/dmd2/mars.c
ldc-0.17.1/dmd2/mars.h
ldc-0.17.1/dmd2/module.c
ldc-0.17.1/dmd2/module.h
ldc-0.17.1/dmd2/mtype.c
ldc-0.17.1/dmd2/mtype.h
ldc-0.17.1/dmd2/nogc.c
ldc-0.17.1/dmd2/nspace.c
ldc-0.17.1/dmd2/nspace.h
ldc-0.17.1/dmd2/opover.c
ldc-0.17.1/dmd2/optimize.c
ldc-0.17.1/dmd2/parse.c
ldc-0.17.1/dmd2/parse.h
ldc-0.17.1/dmd2/readme.txt
ldc-0.17.1/dmd2/root/
ldc-0.17.1/dmd2/root/aav.c
ldc-0.17.1/dmd2/root/aav.h
ldc-0.17.1/dmd2/root/array.h
ldc-0.17.1/dmd2/root/async.c
ldc-0.17.1/dmd2/root/async.h
ldc-0.17.1/dmd2/root/checkedint.c
ldc-0.17.1/dmd2/root/checkedint.h
ldc-0.17.1/dmd2/root/file.c
ldc-0.17.1/dmd2/root/file.h
ldc-0.17.1/dmd2/root/filename.c
ldc-0.17.1/dmd2/root/filename.h
ldc-0.17.1/dmd2/root/longdouble.h
ldc-0.17.1/dmd2/root/man.c
ldc-0.17.1/dmd2/root/newdelete.c
ldc-0.17.1/dmd2/root/object.c
ldc-0.17.1/dmd2/root/object.h
ldc-0.17.1/dmd2/root/outbuffer.c
ldc-0.17.1/dmd2/root/outbuffer.h
ldc-0.17.1/dmd2/root/port.c
ldc-0.17.1/dmd2/root/port.h
ldc-0.17.1/dmd2/root/rmem.c
ldc-0.17.1/dmd2/root/rmem.h
ldc-0.17.1/dmd2/root/root.h
ldc-0.17.1/dmd2/root/speller.c
ldc-0.17.1/dmd2/root/speller.h
ldc-0.17.1/dmd2/root/stringtable.c
ldc-0.17.1/dmd2/root/stringtable.h
ldc-0.17.1/dmd2/sapply.c
ldc-0.17.1/dmd2/scope.c
ldc-0.17.1/dmd2/scope.h
ldc-0.17.1/dmd2/sideeffect.c
ldc-0.17.1/dmd2/statement.c
ldc-0.17.1/dmd2/statement.h
ldc-0.17.1/dmd2/staticassert.c
ldc-0.17.1/dmd2/staticassert.h
ldc-0.17.1/dmd2/struct.c
ldc-0.17.1/dmd2/target.h
ldc-0.17.1/dmd2/template.c
ldc-0.17.1/dmd2/template.h
ldc-0.17.1/dmd2/tokens.c
ldc-0.17.1/dmd2/tokens.h
ldc-0.17.1/dmd2/traits.c
ldc-0.17.1/dmd2/unittests.c
ldc-0.17.1/dmd2/utf.c
ldc-0.17.1/dmd2/utf.h
ldc-0.17.1/dmd2/version.c
ldc-0.17.1/dmd2/version.h
ldc-0.17.1/dmd2/visitor.h
ldc-0.17.1/driver/
ldc-0.17.1/driver/cl_options.cpp
ldc-0.17.1/driver/cl_options.h
ldc-0.17.1/driver/codegenerator.cpp
ldc-0.17.1/driver/codegenerator.h
ldc-0.17.1/driver/configfile.cpp
ldc-0.17.1/driver/configfile.h
ldc-0.17.1/driver/exe_path.cpp
ldc-0.17.1/driver/exe_path.h
ldc-0.17.1/driver/ldc-version.cpp.in
ldc-0.17.1/driver/ldc-version.h
ldc-0.17.1/driver/ldmd.cpp
ldc-0.17.1/driver/linker.cpp
ldc-0.17.1/driver/linker.h
ldc-0.17.1/driver/main.cpp
ldc-0.17.1/driver/response.cpp
ldc-0.17.1/driver/targetmachine.cpp
ldc-0.17.1/driver/targetmachine.h
ldc-0.17.1/driver/toobj.cpp
ldc-0.17.1/driver/toobj.h
ldc-0.17.1/driver/tool.cpp
ldc-0.17.1/driver/tool.h
ldc-0.17.1/gen/
ldc-0.17.1/gen/aa.cpp
ldc-0.17.1/gen/aa.h
ldc-0.17.1/gen/abi-aarch64.cpp
ldc-0.17.1/gen/abi-aarch64.h
ldc-0.17.1/gen/abi-arm.cpp
ldc-0.17.1/gen/abi-arm.h
ldc-0.17.1/gen/abi-generic.h
ldc-0.17.1/gen/abi-mips64.cpp
ldc-0.17.1/gen/abi-mips64.h
ldc-0.17.1/gen/abi-ppc64.cpp
ldc-0.17.1/gen/abi-ppc64.h
ldc-0.17.1/gen/abi-win64.cpp
ldc-0.17.1/gen/abi-win64.h
ldc-0.17.1/gen/abi-x86-64.cpp
ldc-0.17.1/gen/abi-x86-64.h
ldc-0.17.1/gen/abi-x86.cpp
ldc-0.17.1/gen/abi-x86.h
ldc-0.17.1/gen/abi.cpp
ldc-0.17.1/gen/abi.h
ldc-0.17.1/gen/arrays.cpp
ldc-0.17.1/gen/arrays.h
ldc-0.17.1/gen/asm-x86.h
ldc-0.17.1/gen/asmstmt.cpp
ldc-0.17.1/gen/attributes.cpp
ldc-0.17.1/gen/attributes.h
ldc-0.17.1/gen/binops.cpp
ldc-0.17.1/gen/cl_helpers.cpp
ldc-0.17.1/gen/cl_helpers.h
ldc-0.17.1/gen/classes.cpp
ldc-0.17.1/gen/classes.h
ldc-0.17.1/gen/complex.cpp
ldc-0.17.1/gen/complex.h
ldc-0.17.1/gen/coverage.cpp
ldc-0.17.1/gen/coverage.h
ldc-0.17.1/gen/declarations.cpp
ldc-0.17.1/gen/dibuilder.cpp
ldc-0.17.1/gen/dibuilder.h
ldc-0.17.1/gen/dvalue.cpp
ldc-0.17.1/gen/dvalue.h
ldc-0.17.1/gen/functions.cpp
ldc-0.17.1/gen/functions.h
ldc-0.17.1/gen/inlineir.cpp
ldc-0.17.1/gen/inlineir.h
ldc-0.17.1/gen/irstate.cpp
ldc-0.17.1/gen/irstate.h
ldc-0.17.1/gen/linkage.cpp
ldc-0.17.1/gen/linkage.h
ldc-0.17.1/gen/llvm.h
ldc-0.17.1/gen/llvmcompat.h
ldc-0.17.1/gen/llvmhelpers.cpp
ldc-0.17.1/gen/llvmhelpers.h
ldc-0.17.1/gen/logger.cpp
ldc-0.17.1/gen/logger.h
ldc-0.17.1/gen/metadata.h
ldc-0.17.1/gen/module.cpp
ldc-0.17.1/gen/naked.cpp
ldc-0.17.1/gen/nested.cpp
ldc-0.17.1/gen/nested.h
ldc-0.17.1/gen/optimizer.cpp
ldc-0.17.1/gen/optimizer.h
ldc-0.17.1/gen/passes/
ldc-0.17.1/gen/passes/GarbageCollect2Stack.cpp
ldc-0.17.1/gen/passes/Passes.h
ldc-0.17.1/gen/passes/SimplifyDRuntimeCalls.cpp
ldc-0.17.1/gen/passes/StripExternals.cpp
ldc-0.17.1/gen/pragma.cpp
ldc-0.17.1/gen/pragma.h
ldc-0.17.1/gen/programs.cpp
ldc-0.17.1/gen/programs.h
ldc-0.17.1/gen/rttibuilder.cpp
ldc-0.17.1/gen/rttibuilder.h
ldc-0.17.1/gen/runtime.cpp
ldc-0.17.1/gen/runtime.h
ldc-0.17.1/gen/statements.cpp
ldc-0.17.1/gen/structs.cpp
ldc-0.17.1/gen/structs.h
ldc-0.17.1/gen/target.cpp
ldc-0.17.1/gen/tocall.cpp
ldc-0.17.1/gen/toconstelem.cpp
ldc-0.17.1/gen/toir.cpp
ldc-0.17.1/gen/tollvm.cpp
ldc-0.17.1/gen/tollvm.h
ldc-0.17.1/gen/typeinf.h
ldc-0.17.1/gen/typinf.cpp
ldc-0.17.1/gen/uda.cpp
ldc-0.17.1/gen/uda.h
ldc-0.17.1/gen/warnings.cpp
ldc-0.17.1/gen/warnings.h
ldc-0.17.1/ir/
ldc-0.17.1/ir/iraggr.cpp
ldc-0.17.1/ir/iraggr.h
ldc-0.17.1/ir/irclass.cpp
ldc-0.17.1/ir/irdsymbol.cpp
ldc-0.17.1/ir/irdsymbol.h
ldc-0.17.1/ir/irforw.h
ldc-0.17.1/ir/irfunction.cpp
ldc-0.17.1/ir/irfunction.h
ldc-0.17.1/ir/irfuncty.cpp
ldc-0.17.1/ir/irfuncty.h
ldc-0.17.1/ir/irmodule.cpp
ldc-0.17.1/ir/irmodule.h
ldc-0.17.1/ir/irtype.cpp
ldc-0.17.1/ir/irtype.h
ldc-0.17.1/ir/irtypeaggr.cpp
ldc-0.17.1/ir/irtypeaggr.h
ldc-0.17.1/ir/irtypeclass.cpp
ldc-0.17.1/ir/irtypeclass.h
ldc-0.17.1/ir/irtypefunction.cpp
ldc-0.17.1/ir/irtypefunction.h
ldc-0.17.1/ir/irtypestruct.cpp
ldc-0.17.1/ir/irtypestruct.h
ldc-0.17.1/ir/irvar.cpp
ldc-0.17.1/ir/irvar.h
ldc-0.17.1/ldc2.conf.in
ldc-0.17.1/ldc2_install.conf.in
ldc-0.17.1/ldc2_phobos.conf.in
ldc-0.17.1/runtime/
ldc-0.17.1/runtime/CMakeLists.txt
ldc-0.17.1/runtime/README
ldc-0.17.1/runtime/druntime/
ldc-0.17.1/runtime/phobos/
ldc-0.17.1/tests/
ldc-0.17.1/tests/d2/
ldc-0.17.1/tests/d2/CMakeLists.txt
ldc-0.17.1/tests/d2/dmd-testsuite/
ldc-0.17.1/tests/d2/src/
ldc-0.17.1/tests/d2/src/osmodel.mak
ldc-0.17.1/tests/ir/
ldc-0.17.1/tests/ir/.gitignore
ldc-0.17.1/tests/ir/CMakeLists.txt
ldc-0.17.1/tests/ir/align.d
ldc-0.17.1/tests/ir/asm_output.d
ldc-0.17.1/tests/ir/atomicrmw.d
ldc-0.17.1/tests/ir/attr_target_x86.d
ldc-0.17.1/tests/ir/attributes.d
ldc-0.17.1/tests/ir/lit.site.cfg.in
ldc-0.17.1/tests/ir/runlit.py
ldc-0.17.1/utils/
ldc-0.17.1/utils/FileCheck-3.5.cpp
ldc-0.17.1/utils/FileCheck-3.6.cpp
ldc-0.17.1/utils/FileCheck-3.7.cpp
ldc-0.17.1/utils/FileCheck-3.8.cpp
ldc-0.17.1/utils/gen_gccbuiltins.cpp
ldc-0.17.1/utils/not.cpp
ldc-0.17.1/vcbuild/
ldc-0.17.1/vcbuild/alloca.h
ldc-0.17.1/vcbuild/amd64.bat
ldc-0.17.1/vcbuild/msvcEnv.bat
ldc-0.17.1/vcbuild/x86.bat
phase `unpack' succeeded after 0.0 seconds
starting phase `unpack-submodule-sources'
phobos-ldc-v0.17.1/.editorconfig
phobos-ldc-v0.17.1/.gitignore
phobos-ldc-v0.17.1/CONTRIBUTING.md
phobos-ldc-v0.17.1/LICENSE_1_0.txt
phobos-ldc-v0.17.1/README.md
phobos-ldc-v0.17.1/changelog.dd
phobos-ldc-v0.17.1/etc/
phobos-ldc-v0.17.1/etc/c/
phobos-ldc-v0.17.1/etc/c/curl.d
phobos-ldc-v0.17.1/etc/c/odbc/
phobos-ldc-v0.17.1/etc/c/odbc/sql.d
phobos-ldc-v0.17.1/etc/c/odbc/sqlext.d
phobos-ldc-v0.17.1/etc/c/odbc/sqltypes.d
phobos-ldc-v0.17.1/etc/c/odbc/sqlucode.d
phobos-ldc-v0.17.1/etc/c/sqlite3.d
phobos-ldc-v0.17.1/etc/c/zlib/
phobos-ldc-v0.17.1/etc/c/zlib/ChangeLog
phobos-ldc-v0.17.1/etc/c/zlib/README
phobos-ldc-v0.17.1/etc/c/zlib/adler32.c
phobos-ldc-v0.17.1/etc/c/zlib/algorithm.txt
phobos-ldc-v0.17.1/etc/c/zlib/compress.c
phobos-ldc-v0.17.1/etc/c/zlib/crc32.c
phobos-ldc-v0.17.1/etc/c/zlib/crc32.h
phobos-ldc-v0.17.1/etc/c/zlib/deflate.c
phobos-ldc-v0.17.1/etc/c/zlib/deflate.h
phobos-ldc-v0.17.1/etc/c/zlib/example.c
phobos-ldc-v0.17.1/etc/c/zlib/gzclose.c
phobos-ldc-v0.17.1/etc/c/zlib/gzguts.h
phobos-ldc-v0.17.1/etc/c/zlib/gzlib.c
phobos-ldc-v0.17.1/etc/c/zlib/gzread.c
phobos-ldc-v0.17.1/etc/c/zlib/gzwrite.c
phobos-ldc-v0.17.1/etc/c/zlib/infback.c
phobos-ldc-v0.17.1/etc/c/zlib/inffast.c
phobos-ldc-v0.17.1/etc/c/zlib/inffast.h
phobos-ldc-v0.17.1/etc/c/zlib/inffixed.h
phobos-ldc-v0.17.1/etc/c/zlib/inflate.c
phobos-ldc-v0.17.1/etc/c/zlib/inflate.h
phobos-ldc-v0.17.1/etc/c/zlib/inftrees.c
phobos-ldc-v0.17.1/etc/c/zlib/inftrees.h
phobos-ldc-v0.17.1/etc/c/zlib/linux.mak
phobos-ldc-v0.17.1/etc/c/zlib/minigzip.c
phobos-ldc-v0.17.1/etc/c/zlib/osx.mak
phobos-ldc-v0.17.1/etc/c/zlib/trees.c
phobos-ldc-v0.17.1/etc/c/zlib/trees.h
phobos-ldc-v0.17.1/etc/c/zlib/uncompr.c
phobos-ldc-v0.17.1/etc/c/zlib/win32.mak
phobos-ldc-v0.17.1/etc/c/zlib/win64.mak
phobos-ldc-v0.17.1/etc/c/zlib/zconf.h
phobos-ldc-v0.17.1/etc/c/zlib/zlib.3
phobos-ldc-v0.17.1/etc/c/zlib/zlib.h
phobos-ldc-v0.17.1/etc/c/zlib/zutil.c
phobos-ldc-v0.17.1/etc/c/zlib/zutil.h
phobos-ldc-v0.17.1/etc/c/zlib.d
phobos-ldc-v0.17.1/index.d
phobos-ldc-v0.17.1/osmodel.mak
phobos-ldc-v0.17.1/posix.mak
phobos-ldc-v0.17.1/project.ddoc
phobos-ldc-v0.17.1/std/
phobos-ldc-v0.17.1/std/algorithm/
phobos-ldc-v0.17.1/std/algorithm/comparison.d
phobos-ldc-v0.17.1/std/algorithm/internal.d
phobos-ldc-v0.17.1/std/algorithm/iteration.d
phobos-ldc-v0.17.1/std/algorithm/mutation.d
phobos-ldc-v0.17.1/std/algorithm/package.d
phobos-ldc-v0.17.1/std/algorithm/searching.d
phobos-ldc-v0.17.1/std/algorithm/setops.d
phobos-ldc-v0.17.1/std/algorithm/sorting.d
phobos-ldc-v0.17.1/std/array.d
phobos-ldc-v0.17.1/std/ascii.d
phobos-ldc-v0.17.1/std/base64.d
phobos-ldc-v0.17.1/std/bigint.d
phobos-ldc-v0.17.1/std/bitmanip.d
phobos-ldc-v0.17.1/std/c/
phobos-ldc-v0.17.1/std/c/fenv.d
phobos-ldc-v0.17.1/std/c/freebsd/
phobos-ldc-v0.17.1/std/c/freebsd/socket.d
phobos-ldc-v0.17.1/std/c/linux/
phobos-ldc-v0.17.1/std/c/linux/linux.d
phobos-ldc-v0.17.1/std/c/linux/linuxextern.d
phobos-ldc-v0.17.1/std/c/linux/pthread.d
phobos-ldc-v0.17.1/std/c/linux/socket.d
phobos-ldc-v0.17.1/std/c/linux/termios.d
phobos-ldc-v0.17.1/std/c/linux/tipc.d
phobos-ldc-v0.17.1/std/c/locale.d
phobos-ldc-v0.17.1/std/c/math.d
phobos-ldc-v0.17.1/std/c/osx/
phobos-ldc-v0.17.1/std/c/osx/socket.d
phobos-ldc-v0.17.1/std/c/process.d
phobos-ldc-v0.17.1/std/c/stdarg.d
phobos-ldc-v0.17.1/std/c/stddef.d
phobos-ldc-v0.17.1/std/c/stdio.d
phobos-ldc-v0.17.1/std/c/stdlib.d
phobos-ldc-v0.17.1/std/c/string.d
phobos-ldc-v0.17.1/std/c/time.d
phobos-ldc-v0.17.1/std/c/wcharh.d
phobos-ldc-v0.17.1/std/c/windows/
phobos-ldc-v0.17.1/std/c/windows/com.d
phobos-ldc-v0.17.1/std/c/windows/stat.d
phobos-ldc-v0.17.1/std/c/windows/windows.d
phobos-ldc-v0.17.1/std/c/windows/winsock.d
phobos-ldc-v0.17.1/std/compiler.d
phobos-ldc-v0.17.1/std/complex.d
phobos-ldc-v0.17.1/std/concurrency.d
phobos-ldc-v0.17.1/std/container/
phobos-ldc-v0.17.1/std/container/array.d
phobos-ldc-v0.17.1/std/container/binaryheap.d
phobos-ldc-v0.17.1/std/container/dlist.d
phobos-ldc-v0.17.1/std/container/package.d
phobos-ldc-v0.17.1/std/container/rbtree.d
phobos-ldc-v0.17.1/std/container/slist.d
phobos-ldc-v0.17.1/std/container/util.d
phobos-ldc-v0.17.1/std/conv.d
phobos-ldc-v0.17.1/std/cstream.d
phobos-ldc-v0.17.1/std/csv.d
phobos-ldc-v0.17.1/std/datetime.d
phobos-ldc-v0.17.1/std/demangle.d
phobos-ldc-v0.17.1/std/digest/
phobos-ldc-v0.17.1/std/digest/crc.d
phobos-ldc-v0.17.1/std/digest/digest.d
phobos-ldc-v0.17.1/std/digest/md.d
phobos-ldc-v0.17.1/std/digest/ripemd.d
phobos-ldc-v0.17.1/std/digest/sha.d
phobos-ldc-v0.17.1/std/encoding.d
phobos-ldc-v0.17.1/std/exception.d
phobos-ldc-v0.17.1/std/experimental/
phobos-ldc-v0.17.1/std/experimental/logger/
phobos-ldc-v0.17.1/std/experimental/logger/core.d
phobos-ldc-v0.17.1/std/experimental/logger/filelogger.d
phobos-ldc-v0.17.1/std/experimental/logger/multilogger.d
phobos-ldc-v0.17.1/std/experimental/logger/nulllogger.d
phobos-ldc-v0.17.1/std/experimental/logger/package.d
phobos-ldc-v0.17.1/std/experimental/note.md
phobos-ldc-v0.17.1/std/file.d
phobos-ldc-v0.17.1/std/format.d
phobos-ldc-v0.17.1/std/functional.d
phobos-ldc-v0.17.1/std/getopt.d
phobos-ldc-v0.17.1/std/internal/
phobos-ldc-v0.17.1/std/internal/cstring.d
phobos-ldc-v0.17.1/std/internal/digest/
phobos-ldc-v0.17.1/std/internal/digest/sha_SSSE3.d
phobos-ldc-v0.17.1/std/internal/math/
phobos-ldc-v0.17.1/std/internal/math/biguintcore.d
phobos-ldc-v0.17.1/std/internal/math/biguintnoasm.d
phobos-ldc-v0.17.1/std/internal/math/biguintx86.d
phobos-ldc-v0.17.1/std/internal/math/errorfunction.d
phobos-ldc-v0.17.1/std/internal/math/gammafunction.d
phobos-ldc-v0.17.1/std/internal/processinit.d
phobos-ldc-v0.17.1/std/internal/scopebuffer.d
phobos-ldc-v0.17.1/std/internal/test/
phobos-ldc-v0.17.1/std/internal/test/dummyrange.d
phobos-ldc-v0.17.1/std/internal/unicode_comp.d
phobos-ldc-v0.17.1/std/internal/unicode_decomp.d
phobos-ldc-v0.17.1/std/internal/unicode_grapheme.d
phobos-ldc-v0.17.1/std/internal/unicode_norm.d
phobos-ldc-v0.17.1/std/internal/unicode_tables.d
phobos-ldc-v0.17.1/std/internal/windows/
phobos-ldc-v0.17.1/std/internal/windows/advapi32.d
phobos-ldc-v0.17.1/std/json.d
phobos-ldc-v0.17.1/std/math.d
phobos-ldc-v0.17.1/std/mathspecial.d
phobos-ldc-v0.17.1/std/meta.d
phobos-ldc-v0.17.1/std/metastrings.d
phobos-ldc-v0.17.1/std/mmfile.d
phobos-ldc-v0.17.1/std/net/
phobos-ldc-v0.17.1/std/net/curl.d
phobos-ldc-v0.17.1/std/net/isemail.d
phobos-ldc-v0.17.1/std/numeric.d
phobos-ldc-v0.17.1/std/outbuffer.d
phobos-ldc-v0.17.1/std/parallelism.d
phobos-ldc-v0.17.1/std/path.d
phobos-ldc-v0.17.1/std/process.d
phobos-ldc-v0.17.1/std/random.d
phobos-ldc-v0.17.1/std/range/
phobos-ldc-v0.17.1/std/range/interfaces.d
phobos-ldc-v0.17.1/std/range/package.d
phobos-ldc-v0.17.1/std/range/primitives.d
phobos-ldc-v0.17.1/std/regex/
phobos-ldc-v0.17.1/std/regex/internal/
phobos-ldc-v0.17.1/std/regex/internal/backtracking.d
phobos-ldc-v0.17.1/std/regex/internal/generator.d
phobos-ldc-v0.17.1/std/regex/internal/ir.d
phobos-ldc-v0.17.1/std/regex/internal/kickstart.d
phobos-ldc-v0.17.1/std/regex/internal/parser.d
phobos-ldc-v0.17.1/std/regex/internal/tests.d
phobos-ldc-v0.17.1/std/regex/internal/thompson.d
phobos-ldc-v0.17.1/std/regex/package.d
phobos-ldc-v0.17.1/std/signals.d
phobos-ldc-v0.17.1/std/socket.d
phobos-ldc-v0.17.1/std/socketstream.d
phobos-ldc-v0.17.1/std/stdint.d
phobos-ldc-v0.17.1/std/stdio.d
phobos-ldc-v0.17.1/std/stdiobase.d
phobos-ldc-v0.17.1/std/stream.d
phobos-ldc-v0.17.1/std/string.d
phobos-ldc-v0.17.1/std/syserror.d
phobos-ldc-v0.17.1/std/system.d
phobos-ldc-v0.17.1/std/traits.d
phobos-ldc-v0.17.1/std/typecons.d
phobos-ldc-v0.17.1/std/typelist.d
phobos-ldc-v0.17.1/std/typetuple.d
phobos-ldc-v0.17.1/std/uni.d
phobos-ldc-v0.17.1/std/uri.d
phobos-ldc-v0.17.1/std/utf.d
phobos-ldc-v0.17.1/std/uuid.d
phobos-ldc-v0.17.1/std/variant.d
phobos-ldc-v0.17.1/std/windows/
phobos-ldc-v0.17.1/std/windows/charset.d
phobos-ldc-v0.17.1/std/windows/iunknown.d
phobos-ldc-v0.17.1/std/windows/registry.d
phobos-ldc-v0.17.1/std/windows/syserror.d
phobos-ldc-v0.17.1/std/xml.d
phobos-ldc-v0.17.1/std/zip.d
phobos-ldc-v0.17.1/std/zlib.d
phobos-ldc-v0.17.1/unittest.d
phobos-ldc-v0.17.1/win32.mak
phobos-ldc-v0.17.1/win64.mak
druntime-ldc-v0.17.1/.editorconfig
druntime-ldc-v0.17.1/.gitignore
druntime-ldc-v0.17.1/HACKING.md
druntime-ldc-v0.17.1/LICENSE
druntime-ldc-v0.17.1/README.md
druntime-ldc-v0.17.1/benchmark/
druntime-ldc-v0.17.1/benchmark/.gitignore
druntime-ldc-v0.17.1/benchmark/aabench/
druntime-ldc-v0.17.1/benchmark/aabench/bigval.d
druntime-ldc-v0.17.1/benchmark/aabench/bulk.d
druntime-ldc-v0.17.1/benchmark/aabench/int.d
druntime-ldc-v0.17.1/benchmark/aabench/l3cache.d
druntime-ldc-v0.17.1/benchmark/aabench/obj.d
druntime-ldc-v0.17.1/benchmark/aabench/ptr.d
druntime-ldc-v0.17.1/benchmark/aabench/resize.d
druntime-ldc-v0.17.1/benchmark/aabench/stomper.d
druntime-ldc-v0.17.1/benchmark/aabench/string.d
druntime-ldc-v0.17.1/benchmark/extra-files/
druntime-ldc-v0.17.1/benchmark/extra-files/dante.txt
druntime-ldc-v0.17.1/benchmark/gcbench/
druntime-ldc-v0.17.1/benchmark/gcbench/conalloc.d
druntime-ldc-v0.17.1/benchmark/gcbench/conappend.d
druntime-ldc-v0.17.1/benchmark/gcbench/concpu.d
druntime-ldc-v0.17.1/benchmark/gcbench/conmsg.d
druntime-ldc-v0.17.1/benchmark/gcbench/dlist.d
druntime-ldc-v0.17.1/benchmark/gcbench/huge_single.d
druntime-ldc-v0.17.1/benchmark/gcbench/rand_large.d
druntime-ldc-v0.17.1/benchmark/gcbench/rand_small.d
druntime-ldc-v0.17.1/benchmark/gcbench/slist.d
druntime-ldc-v0.17.1/benchmark/gcbench/testgc3.d
druntime-ldc-v0.17.1/benchmark/gcbench/tree1.d
druntime-ldc-v0.17.1/benchmark/gcbench/tree2.d
druntime-ldc-v0.17.1/benchmark/gcbench/vdparser.d
druntime-ldc-v0.17.1/benchmark/gcbench/vdparser.extra/
druntime-ldc-v0.17.1/benchmark/gcbench/vdparser.extra/stdext/
druntime-ldc-v0.17.1/benchmark/gcbench/vdparser.extra/stdext/array.d
druntime-ldc-v0.17.1/benchmark/gcbench/vdparser.extra/stdext/path.d
druntime-ldc-v0.17.1/benchmark/gcbench/vdparser.extra/stdext/string.d
druntime-ldc-v0.17.1/benchmark/gcbench/vdparser.extra/stdext/util.d
druntime-ldc-v0.17.1/benchmark/gcbench/vdparser.extra/vdc/
druntime-ldc-v0.17.1/benchmark/gcbench/vdparser.extra/vdc/ast/
druntime-ldc-v0.17.1/benchmark/gcbench/vdparser.extra/vdc/ast/aggr.d
druntime-ldc-v0.17.1/benchmark/gcbench/vdparser.extra/vdc/ast/all.d
druntime-ldc-v0.17.1/benchmark/gcbench/vdparser.extra/vdc/ast/decl.d
druntime-ldc-v0.17.1/benchmark/gcbench/vdparser.extra/vdc/ast/expr.d
druntime-ldc-v0.17.1/benchmark/gcbench/vdparser.extra/vdc/ast/iasm.d
druntime-ldc-v0.17.1/benchmark/gcbench/vdparser.extra/vdc/ast/misc.d
druntime-ldc-v0.17.1/benchmark/gcbench/vdparser.extra/vdc/ast/mod.d
druntime-ldc-v0.17.1/benchmark/gcbench/vdparser.extra/vdc/ast/node.d
druntime-ldc-v0.17.1/benchmark/gcbench/vdparser.extra/vdc/ast/stmt.d
druntime-ldc-v0.17.1/benchmark/gcbench/vdparser.extra/vdc/ast/tmpl.d
druntime-ldc-v0.17.1/benchmark/gcbench/vdparser.extra/vdc/ast/type.d
druntime-ldc-v0.17.1/benchmark/gcbench/vdparser.extra/vdc/ast/writer.d
druntime-ldc-v0.17.1/benchmark/gcbench/vdparser.extra/vdc/interpret.d
druntime-ldc-v0.17.1/benchmark/gcbench/vdparser.extra/vdc/lexer.d
druntime-ldc-v0.17.1/benchmark/gcbench/vdparser.extra/vdc/logger.d
druntime-ldc-v0.17.1/benchmark/gcbench/vdparser.extra/vdc/parser/
druntime-ldc-v0.17.1/benchmark/gcbench/vdparser.extra/vdc/parser/aggr.d
druntime-ldc-v0.17.1/benchmark/gcbench/vdparser.extra/vdc/parser/decl.d
druntime-ldc-v0.17.1/benchmark/gcbench/vdparser.extra/vdc/parser/engine.d
druntime-ldc-v0.17.1/benchmark/gcbench/vdparser.extra/vdc/parser/expr.d
druntime-ldc-v0.17.1/benchmark/gcbench/vdparser.extra/vdc/parser/iasm.d
druntime-ldc-v0.17.1/benchmark/gcbench/vdparser.extra/vdc/parser/misc.d
druntime-ldc-v0.17.1/benchmark/gcbench/vdparser.extra/vdc/parser/mod.d
druntime-ldc-v0.17.1/benchmark/gcbench/vdparser.extra/vdc/parser/stmt.d
druntime-ldc-v0.17.1/benchmark/gcbench/vdparser.extra/vdc/parser/tmpl.d
druntime-ldc-v0.17.1/benchmark/gcbench/vdparser.extra/vdc/semantic.d
druntime-ldc-v0.17.1/benchmark/gcbench/vdparser.extra/vdc/util.d
druntime-ldc-v0.17.1/benchmark/gcbench/vdparser.extra/vdc/versions.d
druntime-ldc-v0.17.1/benchmark/gcbench/words.d
druntime-ldc-v0.17.1/benchmark/runbench.d
druntime-ldc-v0.17.1/changelog.dd
druntime-ldc-v0.17.1/mak/
druntime-ldc-v0.17.1/mak/COPY
druntime-ldc-v0.17.1/mak/DOCS
druntime-ldc-v0.17.1/mak/IMPORTS
druntime-ldc-v0.17.1/mak/MANIFEST
druntime-ldc-v0.17.1/mak/SRCS
druntime-ldc-v0.17.1/osmodel.mak
druntime-ldc-v0.17.1/posix.mak
druntime-ldc-v0.17.1/project.ddoc
druntime-ldc-v0.17.1/src/
druntime-ldc-v0.17.1/src/core/
druntime-ldc-v0.17.1/src/core/atomic.d
druntime-ldc-v0.17.1/src/core/bitop.d
druntime-ldc-v0.17.1/src/core/checkedint.d
druntime-ldc-v0.17.1/src/core/cpuid.d
druntime-ldc-v0.17.1/src/core/demangle.d
druntime-ldc-v0.17.1/src/core/exception.d
druntime-ldc-v0.17.1/src/core/internal/
druntime-ldc-v0.17.1/src/core/internal/convert.d
druntime-ldc-v0.17.1/src/core/internal/hash.d
druntime-ldc-v0.17.1/src/core/internal/traits.d
druntime-ldc-v0.17.1/src/core/math.d
druntime-ldc-v0.17.1/src/core/memory.d
druntime-ldc-v0.17.1/src/core/runtime.d
druntime-ldc-v0.17.1/src/core/simd.d
druntime-ldc-v0.17.1/src/core/stdc/
druntime-ldc-v0.17.1/src/core/stdc/complex.d
druntime-ldc-v0.17.1/src/core/stdc/config.d
druntime-ldc-v0.17.1/src/core/stdc/ctype.d
druntime-ldc-v0.17.1/src/core/stdc/errno.c
druntime-ldc-v0.17.1/src/core/stdc/errno.d
druntime-ldc-v0.17.1/src/core/stdc/fenv.d
druntime-ldc-v0.17.1/src/core/stdc/float_.d
druntime-ldc-v0.17.1/src/core/stdc/inttypes.d
druntime-ldc-v0.17.1/src/core/stdc/limits.d
druntime-ldc-v0.17.1/src/core/stdc/locale.d
druntime-ldc-v0.17.1/src/core/stdc/math.d
druntime-ldc-v0.17.1/src/core/stdc/signal.d
druntime-ldc-v0.17.1/src/core/stdc/stdarg.d
druntime-ldc-v0.17.1/src/core/stdc/stddef.d
druntime-ldc-v0.17.1/src/core/stdc/stdint.d
druntime-ldc-v0.17.1/src/core/stdc/stdio.d
druntime-ldc-v0.17.1/src/core/stdc/stdlib.d
druntime-ldc-v0.17.1/src/core/stdc/string.d
druntime-ldc-v0.17.1/src/core/stdc/tgmath.d
druntime-ldc-v0.17.1/src/core/stdc/time.d
druntime-ldc-v0.17.1/src/core/stdc/wchar_.d
druntime-ldc-v0.17.1/src/core/stdc/wctype.d
druntime-ldc-v0.17.1/src/core/sync/
druntime-ldc-v0.17.1/src/core/sync/barrier.d
druntime-ldc-v0.17.1/src/core/sync/condition.d
druntime-ldc-v0.17.1/src/core/sync/config.d
druntime-ldc-v0.17.1/src/core/sync/exception.d
druntime-ldc-v0.17.1/src/core/sync/mutex.d
druntime-ldc-v0.17.1/src/core/sync/rwmutex.d
druntime-ldc-v0.17.1/src/core/sync/semaphore.d
druntime-ldc-v0.17.1/src/core/sys/
druntime-ldc-v0.17.1/src/core/sys/freebsd/
druntime-ldc-v0.17.1/src/core/sys/freebsd/dlfcn.d
druntime-ldc-v0.17.1/src/core/sys/freebsd/execinfo.d
druntime-ldc-v0.17.1/src/core/sys/freebsd/sys/
druntime-ldc-v0.17.1/src/core/sys/freebsd/sys/cdefs.d
druntime-ldc-v0.17.1/src/core/sys/freebsd/sys/elf.d
druntime-ldc-v0.17.1/src/core/sys/freebsd/sys/elf32.d
druntime-ldc-v0.17.1/src/core/sys/freebsd/sys/elf64.d
druntime-ldc-v0.17.1/src/core/sys/freebsd/sys/elf_common.d
druntime-ldc-v0.17.1/src/core/sys/freebsd/sys/event.d
druntime-ldc-v0.17.1/src/core/sys/freebsd/sys/link_elf.d
druntime-ldc-v0.17.1/src/core/sys/freebsd/sys/mman.d
druntime-ldc-v0.17.1/src/core/sys/freebsd/time.d
druntime-ldc-v0.17.1/src/core/sys/linux/
druntime-ldc-v0.17.1/src/core/sys/linux/config.d
druntime-ldc-v0.17.1/src/core/sys/linux/dlfcn.d
druntime-ldc-v0.17.1/src/core/sys/linux/elf.d
druntime-ldc-v0.17.1/src/core/sys/linux/epoll.d
druntime-ldc-v0.17.1/src/core/sys/linux/errno.d
druntime-ldc-v0.17.1/src/core/sys/linux/execinfo.d
druntime-ldc-v0.17.1/src/core/sys/linux/link.d
druntime-ldc-v0.17.1/src/core/sys/linux/stdio.d
druntime-ldc-v0.17.1/src/core/sys/linux/sys/
druntime-ldc-v0.17.1/src/core/sys/linux/sys/inotify.d
druntime-ldc-v0.17.1/src/core/sys/linux/sys/mman.d
druntime-ldc-v0.17.1/src/core/sys/linux/sys/signalfd.d
druntime-ldc-v0.17.1/src/core/sys/linux/sys/sysinfo.d
druntime-ldc-v0.17.1/src/core/sys/linux/sys/xattr.d
druntime-ldc-v0.17.1/src/core/sys/linux/termios.d
druntime-ldc-v0.17.1/src/core/sys/linux/time.d
druntime-ldc-v0.17.1/src/core/sys/linux/tipc.d
druntime-ldc-v0.17.1/src/core/sys/osx/
druntime-ldc-v0.17.1/src/core/sys/osx/execinfo.d
druntime-ldc-v0.17.1/src/core/sys/osx/mach/
druntime-ldc-v0.17.1/src/core/sys/osx/mach/dyld.d
druntime-ldc-v0.17.1/src/core/sys/osx/mach/getsect.d
druntime-ldc-v0.17.1/src/core/sys/osx/mach/kern_return.d
druntime-ldc-v0.17.1/src/core/sys/osx/mach/loader.d
druntime-ldc-v0.17.1/src/core/sys/osx/mach/port.d
druntime-ldc-v0.17.1/src/core/sys/osx/mach/semaphore.d
druntime-ldc-v0.17.1/src/core/sys/osx/mach/thread_act.d
druntime-ldc-v0.17.1/src/core/sys/osx/pthread.d
druntime-ldc-v0.17.1/src/core/sys/osx/sys/
druntime-ldc-v0.17.1/src/core/sys/osx/sys/cdefs.d
druntime-ldc-v0.17.1/src/core/sys/osx/sys/event.d
druntime-ldc-v0.17.1/src/core/sys/osx/sys/mman.d
druntime-ldc-v0.17.1/src/core/sys/posix/
druntime-ldc-v0.17.1/src/core/sys/posix/arpa/
druntime-ldc-v0.17.1/src/core/sys/posix/arpa/inet.d
druntime-ldc-v0.17.1/src/core/sys/posix/config.d
druntime-ldc-v0.17.1/src/core/sys/posix/dirent.d
druntime-ldc-v0.17.1/src/core/sys/posix/dlfcn.d
druntime-ldc-v0.17.1/src/core/sys/posix/fcntl.d
druntime-ldc-v0.17.1/src/core/sys/posix/grp.d
druntime-ldc-v0.17.1/src/core/sys/posix/inttypes.d
druntime-ldc-v0.17.1/src/core/sys/posix/net/
druntime-ldc-v0.17.1/src/core/sys/posix/net/if_.d
druntime-ldc-v0.17.1/src/core/sys/posix/netdb.d
druntime-ldc-v0.17.1/src/core/sys/posix/netinet/
druntime-ldc-v0.17.1/src/core/sys/posix/netinet/in_.d
druntime-ldc-v0.17.1/src/core/sys/posix/netinet/tcp.d
druntime-ldc-v0.17.1/src/core/sys/posix/poll.d
druntime-ldc-v0.17.1/src/core/sys/posix/pthread.d
druntime-ldc-v0.17.1/src/core/sys/posix/pwd.d
druntime-ldc-v0.17.1/src/core/sys/posix/sched.d
druntime-ldc-v0.17.1/src/core/sys/posix/semaphore.d
druntime-ldc-v0.17.1/src/core/sys/posix/setjmp.d
druntime-ldc-v0.17.1/src/core/sys/posix/signal.d
druntime-ldc-v0.17.1/src/core/sys/posix/stdio.d
druntime-ldc-v0.17.1/src/core/sys/posix/stdlib.d
druntime-ldc-v0.17.1/src/core/sys/posix/sys/
druntime-ldc-v0.17.1/src/core/sys/posix/sys/ioctl.d
druntime-ldc-v0.17.1/src/core/sys/posix/sys/ipc.d
druntime-ldc-v0.17.1/src/core/sys/posix/sys/mman.d
druntime-ldc-v0.17.1/src/core/sys/posix/sys/msg.d
druntime-ldc-v0.17.1/src/core/sys/posix/sys/resource.d
druntime-ldc-v0.17.1/src/core/sys/posix/sys/select.d
druntime-ldc-v0.17.1/src/core/sys/posix/sys/shm.d
druntime-ldc-v0.17.1/src/core/sys/posix/sys/socket.d
druntime-ldc-v0.17.1/src/core/sys/posix/sys/stat.d
druntime-ldc-v0.17.1/src/core/sys/posix/sys/statvfs.d
druntime-ldc-v0.17.1/src/core/sys/posix/sys/time.d
druntime-ldc-v0.17.1/src/core/sys/posix/sys/types.d
druntime-ldc-v0.17.1/src/core/sys/posix/sys/uio.d
druntime-ldc-v0.17.1/src/core/sys/posix/sys/un.d
druntime-ldc-v0.17.1/src/core/sys/posix/sys/utsname.d
druntime-ldc-v0.17.1/src/core/sys/posix/sys/wait.d
druntime-ldc-v0.17.1/src/core/sys/posix/syslog.d
druntime-ldc-v0.17.1/src/core/sys/posix/termios.d
druntime-ldc-v0.17.1/src/core/sys/posix/time.d
druntime-ldc-v0.17.1/src/core/sys/posix/ucontext.d
druntime-ldc-v0.17.1/src/core/sys/posix/unistd.d
druntime-ldc-v0.17.1/src/core/sys/posix/utime.d
druntime-ldc-v0.17.1/src/core/sys/solaris/
druntime-ldc-v0.17.1/src/core/sys/solaris/dlfcn.d
druntime-ldc-v0.17.1/src/core/sys/solaris/elf.d
druntime-ldc-v0.17.1/src/core/sys/solaris/execinfo.d
druntime-ldc-v0.17.1/src/core/sys/solaris/libelf.d
druntime-ldc-v0.17.1/src/core/sys/solaris/link.d
druntime-ldc-v0.17.1/src/core/sys/solaris/sys/
druntime-ldc-v0.17.1/src/core/sys/solaris/sys/elf.d
druntime-ldc-v0.17.1/src/core/sys/solaris/sys/elf_386.d
druntime-ldc-v0.17.1/src/core/sys/solaris/sys/elf_SPARC.d
druntime-ldc-v0.17.1/src/core/sys/solaris/sys/elf_amd64.d
druntime-ldc-v0.17.1/src/core/sys/solaris/sys/elf_notes.d
druntime-ldc-v0.17.1/src/core/sys/solaris/sys/elftypes.d
druntime-ldc-v0.17.1/src/core/sys/solaris/sys/link.d
druntime-ldc-v0.17.1/src/core/sys/solaris/sys/priocntl.d
druntime-ldc-v0.17.1/src/core/sys/solaris/sys/procset.d
druntime-ldc-v0.17.1/src/core/sys/solaris/sys/types.d
druntime-ldc-v0.17.1/src/core/sys/solaris/time.d
druntime-ldc-v0.17.1/src/core/sys/windows/
druntime-ldc-v0.17.1/src/core/sys/windows/com.d
druntime-ldc-v0.17.1/src/core/sys/windows/dbghelp.d
druntime-ldc-v0.17.1/src/core/sys/windows/dll.d
druntime-ldc-v0.17.1/src/core/sys/windows/stacktrace.d
druntime-ldc-v0.17.1/src/core/sys/windows/stat.d
druntime-ldc-v0.17.1/src/core/sys/windows/threadaux.d
druntime-ldc-v0.17.1/src/core/sys/windows/windows.d
druntime-ldc-v0.17.1/src/core/sys/windows/winsock2.d
druntime-ldc-v0.17.1/src/core/thread.d
druntime-ldc-v0.17.1/src/core/threadasm.S
druntime-ldc-v0.17.1/src/core/time.d
druntime-ldc-v0.17.1/src/core/vararg.d
druntime-ldc-v0.17.1/src/etc/
druntime-ldc-v0.17.1/src/etc/linux/
druntime-ldc-v0.17.1/src/etc/linux/memoryerror.d
druntime-ldc-v0.17.1/src/gc/
druntime-ldc-v0.17.1/src/gc/bits.d
druntime-ldc-v0.17.1/src/gc/config.d
druntime-ldc-v0.17.1/src/gc/gc.d
druntime-ldc-v0.17.1/src/gc/os.d
druntime-ldc-v0.17.1/src/gc/pooltable.d
druntime-ldc-v0.17.1/src/gc/proxy.d
druntime-ldc-v0.17.1/src/gc/stats.d
druntime-ldc-v0.17.1/src/gcstub/
druntime-ldc-v0.17.1/src/gcstub/gc.d
druntime-ldc-v0.17.1/src/ldc/
druntime-ldc-v0.17.1/src/ldc/arm_unwind.c
druntime-ldc-v0.17.1/src/ldc/arrayinit.d
druntime-ldc-v0.17.1/src/ldc/attributes.d
druntime-ldc-v0.17.1/src/ldc/eh/
druntime-ldc-v0.17.1/src/ldc/eh/common.d
druntime-ldc-v0.17.1/src/ldc/eh/fixedpool.d
druntime-ldc-v0.17.1/src/ldc/eh/libunwind.d
druntime-ldc-v0.17.1/src/ldc/eh/win32.d
druntime-ldc-v0.17.1/src/ldc/eh/win64.d
druntime-ldc-v0.17.1/src/ldc/eh_asm.S
druntime-ldc-v0.17.1/src/ldc/internal/
druntime-ldc-v0.17.1/src/ldc/internal/vararg.di
druntime-ldc-v0.17.1/src/ldc/intrinsics.di
druntime-ldc-v0.17.1/src/ldc/llvmasm.di
druntime-ldc-v0.17.1/src/ldc/msvc.c
druntime-ldc-v0.17.1/src/ldc/osx_tls.c
druntime-ldc-v0.17.1/src/ldc/simd.di
druntime-ldc-v0.17.1/src/object.d
druntime-ldc-v0.17.1/src/rt/
druntime-ldc-v0.17.1/src/rt/aApply.d
druntime-ldc-v0.17.1/src/rt/aApplyR.d
druntime-ldc-v0.17.1/src/rt/aaA.d
druntime-ldc-v0.17.1/src/rt/adi.d
druntime-ldc-v0.17.1/src/rt/alloca.d
druntime-ldc-v0.17.1/src/rt/arrayassign.d
druntime-ldc-v0.17.1/src/rt/arraybyte.d
druntime-ldc-v0.17.1/src/rt/arraycast.d
druntime-ldc-v0.17.1/src/rt/arraycat.d
druntime-ldc-v0.17.1/src/rt/arraydouble.d
druntime-ldc-v0.17.1/src/rt/arrayfloat.d
druntime-ldc-v0.17.1/src/rt/arrayint.d
druntime-ldc-v0.17.1/src/rt/arrayreal.d
druntime-ldc-v0.17.1/src/rt/arrayshort.d
druntime-ldc-v0.17.1/src/rt/bss_section.c
druntime-ldc-v0.17.1/src/rt/cast_.d
druntime-ldc-v0.17.1/src/rt/cmath2.d
druntime-ldc-v0.17.1/src/rt/config.d
druntime-ldc-v0.17.1/src/rt/cover.d
druntime-ldc-v0.17.1/src/rt/critical_.d
druntime-ldc-v0.17.1/src/rt/deh.d
druntime-ldc-v0.17.1/src/rt/deh_win32.d
druntime-ldc-v0.17.1/src/rt/deh_win64_posix.d
druntime-ldc-v0.17.1/src/rt/dmain2.d
druntime-ldc-v0.17.1/src/rt/dylib_fixes.c
druntime-ldc-v0.17.1/src/rt/invariant.d
druntime-ldc-v0.17.1/src/rt/lifetime.d
druntime-ldc-v0.17.1/src/rt/llmath.d
druntime-ldc-v0.17.1/src/rt/memory.d
druntime-ldc-v0.17.1/src/rt/memset.d
druntime-ldc-v0.17.1/src/rt/minfo.d
druntime-ldc-v0.17.1/src/rt/minit.asm
druntime-ldc-v0.17.1/src/rt/minit.obj
druntime-ldc-v0.17.1/src/rt/monitor_.d
druntime-ldc-v0.17.1/src/rt/msvc.c
druntime-ldc-v0.17.1/src/rt/msvc_math.c
druntime-ldc-v0.17.1/src/rt/obj.d
druntime-ldc-v0.17.1/src/rt/profilegc.d
druntime-ldc-v0.17.1/src/rt/qsort.d
druntime-ldc-v0.17.1/src/rt/sections.d
druntime-ldc-v0.17.1/src/rt/sections_android.d
druntime-ldc-v0.17.1/src/rt/sections_elf_shared.d
druntime-ldc-v0.17.1/src/rt/sections_ldc.d
druntime-ldc-v0.17.1/src/rt/sections_osx.d
druntime-ldc-v0.17.1/src/rt/sections_solaris.d
druntime-ldc-v0.17.1/src/rt/sections_win32.d
druntime-ldc-v0.17.1/src/rt/sections_win64.d
druntime-ldc-v0.17.1/src/rt/switch_.d
druntime-ldc-v0.17.1/src/rt/tlsgc.d
druntime-ldc-v0.17.1/src/rt/trace.d
druntime-ldc-v0.17.1/src/rt/tracegc.d
druntime-ldc-v0.17.1/src/rt/typeinfo/
druntime-ldc-v0.17.1/src/rt/typeinfo/ti_AC.d
druntime-ldc-v0.17.1/src/rt/typeinfo/ti_Acdouble.d
druntime-ldc-v0.17.1/src/rt/typeinfo/ti_Acfloat.d
druntime-ldc-v0.17.1/src/rt/typeinfo/ti_Acreal.d
druntime-ldc-v0.17.1/src/rt/typeinfo/ti_Adouble.d
druntime-ldc-v0.17.1/src/rt/typeinfo/ti_Afloat.d
druntime-ldc-v0.17.1/src/rt/typeinfo/ti_Ag.d
druntime-ldc-v0.17.1/src/rt/typeinfo/ti_Aint.d
druntime-ldc-v0.17.1/src/rt/typeinfo/ti_Along.d
druntime-ldc-v0.17.1/src/rt/typeinfo/ti_Areal.d
druntime-ldc-v0.17.1/src/rt/typeinfo/ti_Ashort.d
druntime-ldc-v0.17.1/src/rt/typeinfo/ti_C.d
druntime-ldc-v0.17.1/src/rt/typeinfo/ti_byte.d
druntime-ldc-v0.17.1/src/rt/typeinfo/ti_cdouble.d
druntime-ldc-v0.17.1/src/rt/typeinfo/ti_cent.d
druntime-ldc-v0.17.1/src/rt/typeinfo/ti_cfloat.d
druntime-ldc-v0.17.1/src/rt/typeinfo/ti_char.d
druntime-ldc-v0.17.1/src/rt/typeinfo/ti_creal.d
druntime-ldc-v0.17.1/src/rt/typeinfo/ti_dchar.d
druntime-ldc-v0.17.1/src/rt/typeinfo/ti_delegate.d
druntime-ldc-v0.17.1/src/rt/typeinfo/ti_double.d
druntime-ldc-v0.17.1/src/rt/typeinfo/ti_float.d
druntime-ldc-v0.17.1/src/rt/typeinfo/ti_idouble.d
druntime-ldc-v0.17.1/src/rt/typeinfo/ti_ifloat.d
druntime-ldc-v0.17.1/src/rt/typeinfo/ti_int.d
druntime-ldc-v0.17.1/src/rt/typeinfo/ti_ireal.d
druntime-ldc-v0.17.1/src/rt/typeinfo/ti_long.d
druntime-ldc-v0.17.1/src/rt/typeinfo/ti_ptr.d
druntime-ldc-v0.17.1/src/rt/typeinfo/ti_real.d
druntime-ldc-v0.17.1/src/rt/typeinfo/ti_short.d
druntime-ldc-v0.17.1/src/rt/typeinfo/ti_ubyte.d
druntime-ldc-v0.17.1/src/rt/typeinfo/ti_ucent.d
druntime-ldc-v0.17.1/src/rt/typeinfo/ti_uint.d
druntime-ldc-v0.17.1/src/rt/typeinfo/ti_ulong.d
druntime-ldc-v0.17.1/src/rt/typeinfo/ti_ushort.d
druntime-ldc-v0.17.1/src/rt/typeinfo/ti_void.d
druntime-ldc-v0.17.1/src/rt/typeinfo/ti_wchar.d
druntime-ldc-v0.17.1/src/rt/util/
druntime-ldc-v0.17.1/src/rt/util/array.d
druntime-ldc-v0.17.1/src/rt/util/container/
druntime-ldc-v0.17.1/src/rt/util/container/array.d
druntime-ldc-v0.17.1/src/rt/util/container/common.d
druntime-ldc-v0.17.1/src/rt/util/container/hashtab.d
druntime-ldc-v0.17.1/src/rt/util/container/treap.d
druntime-ldc-v0.17.1/src/rt/util/hash.d
druntime-ldc-v0.17.1/src/rt/util/random.d
druntime-ldc-v0.17.1/src/rt/util/string.d
druntime-ldc-v0.17.1/src/rt/util/typeinfo.d
druntime-ldc-v0.17.1/src/rt/util/utf.d
druntime-ldc-v0.17.1/src/test_runner.d
druntime-ldc-v0.17.1/test/
druntime-ldc-v0.17.1/test/coverage/
druntime-ldc-v0.17.1/test/coverage/Makefile
druntime-ldc-v0.17.1/test/coverage/src-basic.lst.exp
druntime-ldc-v0.17.1/test/coverage/src-merge.lst.exp
druntime-ldc-v0.17.1/test/coverage/src-merge_true.lst.exp
druntime-ldc-v0.17.1/test/coverage/src/
druntime-ldc-v0.17.1/test/coverage/src/basic.d
druntime-ldc-v0.17.1/test/coverage/src/merge.d
druntime-ldc-v0.17.1/test/coverage/src/merge_true.d
druntime-ldc-v0.17.1/test/exceptions/
druntime-ldc-v0.17.1/test/exceptions/Makefile
druntime-ldc-v0.17.1/test/exceptions/src/
druntime-ldc-v0.17.1/test/exceptions/src/stderr_msg.d
druntime-ldc-v0.17.1/test/exceptions/src/unittest_assert.d
druntime-ldc-v0.17.1/test/init_fini/
druntime-ldc-v0.17.1/test/init_fini/Makefile
druntime-ldc-v0.17.1/test/init_fini/src/
druntime-ldc-v0.17.1/test/init_fini/src/runtime_args.d
druntime-ldc-v0.17.1/test/init_fini/src/thread_join.d
druntime-ldc-v0.17.1/test/profile/
druntime-ldc-v0.17.1/test/profile/Makefile
druntime-ldc-v0.17.1/test/profile/both.def.exp
druntime-ldc-v0.17.1/test/profile/bothgc.log.exp
druntime-ldc-v0.17.1/test/profile/myprofilegc.log.exp
druntime-ldc-v0.17.1/test/profile/mytrace.def.exp
druntime-ldc-v0.17.1/test/profile/src/
druntime-ldc-v0.17.1/test/profile/src/both.d
druntime-ldc-v0.17.1/test/profile/src/profile.d
druntime-ldc-v0.17.1/test/profile/src/profilegc.d
druntime-ldc-v0.17.1/test/shared/
druntime-ldc-v0.17.1/test/shared/.gitignore
druntime-ldc-v0.17.1/test/shared/Makefile
druntime-ldc-v0.17.1/test/shared/src/
druntime-ldc-v0.17.1/test/shared/src/finalize.d
druntime-ldc-v0.17.1/test/shared/src/host.c
druntime-ldc-v0.17.1/test/shared/src/lib.d
druntime-ldc-v0.17.1/test/shared/src/lib_13414.d
druntime-ldc-v0.17.1/test/shared/src/liblinkdep.d
druntime-ldc-v0.17.1/test/shared/src/libloaddep.d
druntime-ldc-v0.17.1/test/shared/src/link.d
druntime-ldc-v0.17.1/test/shared/src/linkD.c
druntime-ldc-v0.17.1/test/shared/src/linkDR.c
druntime-ldc-v0.17.1/test/shared/src/link_linkdep.d
druntime-ldc-v0.17.1/test/shared/src/link_loaddep.d
druntime-ldc-v0.17.1/test/shared/src/load.d
druntime-ldc-v0.17.1/test/shared/src/loadDR.c
druntime-ldc-v0.17.1/test/shared/src/load_13414.d
druntime-ldc-v0.17.1/test/shared/src/load_linkdep.d
druntime-ldc-v0.17.1/test/shared/src/load_loaddep.d
druntime-ldc-v0.17.1/test/shared/src/plugin.d
druntime-ldc-v0.17.1/win32.mak
druntime-ldc-v0.17.1/win64.mak
dmd-testsuite-ldc-v0.17.1/.gitignore
dmd-testsuite-ldc-v0.17.1/Makefile
dmd-testsuite-ldc-v0.17.1/README
dmd-testsuite-ldc-v0.17.1/combinations.d
dmd-testsuite-ldc-v0.17.1/compilable/
dmd-testsuite-ldc-v0.17.1/compilable/99bottles.d
dmd-testsuite-ldc-v0.17.1/compilable/a3682.d
dmd-testsuite-ldc-v0.17.1/compilable/aliasdecl.d
dmd-testsuite-ldc-v0.17.1/compilable/art4769.d
dmd-testsuite-ldc-v0.17.1/compilable/b1215.d
dmd-testsuite-ldc-v0.17.1/compilable/b33.d
dmd-testsuite-ldc-v0.17.1/compilable/b6395.d
dmd-testsuite-ldc-v0.17.1/compilable/bug11735.d
dmd-testsuite-ldc-v0.17.1/compilable/bug6963.d
dmd-testsuite-ldc-v0.17.1/compilable/callconv.d
dmd-testsuite-ldc-v0.17.1/compilable/compile1.d
dmd-testsuite-ldc-v0.17.1/compilable/const.d
dmd-testsuite-ldc-v0.17.1/compilable/cppmangle.d
dmd-testsuite-ldc-v0.17.1/compilable/ddoc1.d
dmd-testsuite-ldc-v0.17.1/compilable/ddoc10.d
dmd-testsuite-ldc-v0.17.1/compilable/ddoc10236.d
dmd-testsuite-ldc-v0.17.1/compilable/ddoc10236b.d
dmd-testsuite-ldc-v0.17.1/compilable/ddoc10325.d
dmd-testsuite-ldc-v0.17.1/compilable/ddoc10334.d
dmd-testsuite-ldc-v0.17.1/compilable/ddoc10366.d
dmd-testsuite-ldc-v0.17.1/compilable/ddoc10367.d
dmd-testsuite-ldc-v0.17.1/compilable/ddoc10869.d
dmd-testsuite-ldc-v0.17.1/compilable/ddoc10870.d
dmd-testsuite-ldc-v0.17.1/compilable/ddoc11.d
dmd-testsuite-ldc-v0.17.1/compilable/ddoc11479.d
dmd-testsuite-ldc-v0.17.1/compilable/ddoc11511.d
dmd-testsuite-ldc-v0.17.1/compilable/ddoc11823.d
dmd-testsuite-ldc-v0.17.1/compilable/ddoc12.d
dmd-testsuite-ldc-v0.17.1/compilable/ddoc12706.d
dmd-testsuite-ldc-v0.17.1/compilable/ddoc12745.d
dmd-testsuite-ldc-v0.17.1/compilable/ddoc13.d
dmd-testsuite-ldc-v0.17.1/compilable/ddoc13270.d
dmd-testsuite-ldc-v0.17.1/compilable/ddoc13502.d
dmd-testsuite-ldc-v0.17.1/compilable/ddoc13645.d
dmd-testsuite-ldc-v0.17.1/compilable/ddoc14.d
dmd-testsuite-ldc-v0.17.1/compilable/ddoc198.d
dmd-testsuite-ldc-v0.17.1/compilable/ddoc2.d
dmd-testsuite-ldc-v0.17.1/compilable/ddoc2273.d
dmd-testsuite-ldc-v0.17.1/compilable/ddoc3.d
dmd-testsuite-ldc-v0.17.1/compilable/ddoc4.d
dmd-testsuite-ldc-v0.17.1/compilable/ddoc4162.d
dmd-testsuite-ldc-v0.17.1/compilable/ddoc4899.d
dmd-testsuite-ldc-v0.17.1/compilable/ddoc5.d
dmd-testsuite-ldc-v0.17.1/compilable/ddoc5446.d
dmd-testsuite-ldc-v0.17.1/compilable/ddoc5446a.d
dmd-testsuite-ldc-v0.17.1/compilable/ddoc5446b.d
dmd-testsuite-ldc-v0.17.1/compilable/ddoc6.d
dmd-testsuite-ldc-v0.17.1/compilable/ddoc648.d
dmd-testsuite-ldc-v0.17.1/compilable/ddoc6491.d
dmd-testsuite-ldc-v0.17.1/compilable/ddoc7.d
dmd-testsuite-ldc-v0.17.1/compilable/ddoc7555.d
dmd-testsuite-ldc-v0.17.1/compilable/ddoc7656.d
dmd-testsuite-ldc-v0.17.1/compilable/ddoc7715.d
dmd-testsuite-ldc-v0.17.1/compilable/ddoc7795.d
dmd-testsuite-ldc-v0.17.1/compilable/ddoc8.d
dmd-testsuite-ldc-v0.17.1/compilable/ddoc8271.d
dmd-testsuite-ldc-v0.17.1/compilable/ddoc8739.d
dmd-testsuite-ldc-v0.17.1/compilable/ddoc9.d
dmd-testsuite-ldc-v0.17.1/compilable/ddoc9037.d
dmd-testsuite-ldc-v0.17.1/compilable/ddoc9155.d
dmd-testsuite-ldc-v0.17.1/compilable/ddoc9305.d
dmd-testsuite-ldc-v0.17.1/compilable/ddoc9369.d
dmd-testsuite-ldc-v0.17.1/compilable/ddoc9475.d
dmd-testsuite-ldc-v0.17.1/compilable/ddoc9497a.d
dmd-testsuite-ldc-v0.17.1/compilable/ddoc9497b.d
dmd-testsuite-ldc-v0.17.1/compilable/ddoc9497c.d
dmd-testsuite-ldc-v0.17.1/compilable/ddoc9497d.d
dmd-testsuite-ldc-v0.17.1/compilable/ddoc9676a.d
dmd-testsuite-ldc-v0.17.1/compilable/ddoc9676b.d
dmd-testsuite-ldc-v0.17.1/compilable/ddoc9727.d
dmd-testsuite-ldc-v0.17.1/compilable/ddoc9764.sh
dmd-testsuite-ldc-v0.17.1/compilable/ddoc9789.d
dmd-testsuite-ldc-v0.17.1/compilable/ddoc9903.d
dmd-testsuite-ldc-v0.17.1/compilable/ddocYear.d
dmd-testsuite-ldc-v0.17.1/compilable/ddocbackticks.d
dmd-testsuite-ldc-v0.17.1/compilable/ddocunittest.d
dmd-testsuite-ldc-v0.17.1/compilable/debuginfo.d
dmd-testsuite-ldc-v0.17.1/compilable/defa.d
dmd-testsuite-ldc-v0.17.1/compilable/depmsg.d
dmd-testsuite-ldc-v0.17.1/compilable/deprecate12979a.d
dmd-testsuite-ldc-v0.17.1/compilable/deprecate14283.d
dmd-testsuite-ldc-v0.17.1/compilable/deprecate2.d
dmd-testsuite-ldc-v0.17.1/compilable/depsOutput9948.d
dmd-testsuite-ldc-v0.17.1/compilable/derivedarray.d
dmd-testsuite-ldc-v0.17.1/compilable/diag10768.d
dmd-testsuite-ldc-v0.17.1/compilable/diag11066.d
dmd-testsuite-ldc-v0.17.1/compilable/diag4596.d
dmd-testsuite-ldc-v0.17.1/compilable/empty_file.d
dmd-testsuite-ldc-v0.17.1/compilable/extra-files/
dmd-testsuite-ldc-v0.17.1/compilable/extra-files/c6395.d
dmd-testsuite-ldc-v0.17.1/compilable/extra-files/ddoc1.html
dmd-testsuite-ldc-v0.17.1/compilable/extra-files/ddoc10.html
dmd-testsuite-ldc-v0.17.1/compilable/extra-files/ddoc10325.html
dmd-testsuite-ldc-v0.17.1/compilable/extra-files/ddoc10334.html
dmd-testsuite-ldc-v0.17.1/compilable/extra-files/ddoc10366.html
dmd-testsuite-ldc-v0.17.1/compilable/extra-files/ddoc10367.ddoc
dmd-testsuite-ldc-v0.17.1/compilable/extra-files/ddoc10367.html
dmd-testsuite-ldc-v0.17.1/compilable/extra-files/ddoc10869.html
dmd-testsuite-ldc-v0.17.1/compilable/extra-files/ddoc10870.html
dmd-testsuite-ldc-v0.17.1/compilable/extra-files/ddoc11.html
dmd-testsuite-ldc-v0.17.1/compilable/extra-files/ddoc11479.html
dmd-testsuite-ldc-v0.17.1/compilable/extra-files/ddoc11511.html
dmd-testsuite-ldc-v0.17.1/compilable/extra-files/ddoc11823.html
dmd-testsuite-ldc-v0.17.1/compilable/extra-files/ddoc12.html
dmd-testsuite-ldc-v0.17.1/compilable/extra-files/ddoc12706.html
dmd-testsuite-ldc-v0.17.1/compilable/extra-files/ddoc12745.html
dmd-testsuite-ldc-v0.17.1/compilable/extra-files/ddoc13.html
dmd-testsuite-ldc-v0.17.1/compilable/extra-files/ddoc13270.html
dmd-testsuite-ldc-v0.17.1/compilable/extra-files/ddoc13645.html
dmd-testsuite-ldc-v0.17.1/compilable/extra-files/ddoc14.html
dmd-testsuite-ldc-v0.17.1/compilable/extra-files/ddoc198.ddoc
dmd-testsuite-ldc-v0.17.1/compilable/extra-files/ddoc198.html
dmd-testsuite-ldc-v0.17.1/compilable/extra-files/ddoc2.html
dmd-testsuite-ldc-v0.17.1/compilable/extra-files/ddoc2273.html
dmd-testsuite-ldc-v0.17.1/compilable/extra-files/ddoc3.ddoc
dmd-testsuite-ldc-v0.17.1/compilable/extra-files/ddoc3.html
dmd-testsuite-ldc-v0.17.1/compilable/extra-files/ddoc4.html
dmd-testsuite-ldc-v0.17.1/compilable/extra-files/ddoc4162.html
dmd-testsuite-ldc-v0.17.1/compilable/extra-files/ddoc5.html
dmd-testsuite-ldc-v0.17.1/compilable/extra-files/ddoc5446.html
dmd-testsuite-ldc-v0.17.1/compilable/extra-files/ddoc6.html
dmd-testsuite-ldc-v0.17.1/compilable/extra-files/ddoc648.html
dmd-testsuite-ldc-v0.17.1/compilable/extra-files/ddoc6491.html
dmd-testsuite-ldc-v0.17.1/compilable/extra-files/ddoc7.html
dmd-testsuite-ldc-v0.17.1/compilable/extra-files/ddoc7555.html
dmd-testsuite-ldc-v0.17.1/compilable/extra-files/ddoc7656.html
dmd-testsuite-ldc-v0.17.1/compilable/extra-files/ddoc7715.html
dmd-testsuite-ldc-v0.17.1/compilable/extra-files/ddoc7795.html
dmd-testsuite-ldc-v0.17.1/compilable/extra-files/ddoc8.html
dmd-testsuite-ldc-v0.17.1/compilable/extra-files/ddoc8271.html
dmd-testsuite-ldc-v0.17.1/compilable/extra-files/ddoc8739.html
dmd-testsuite-ldc-v0.17.1/compilable/extra-files/ddoc9.html
dmd-testsuite-ldc-v0.17.1/compilable/extra-files/ddoc9037.html
dmd-testsuite-ldc-v0.17.1/compilable/extra-files/ddoc9155.html
dmd-testsuite-ldc-v0.17.1/compilable/extra-files/ddoc9305.html
dmd-testsuite-ldc-v0.17.1/compilable/extra-files/ddoc9369.ddoc
dmd-testsuite-ldc-v0.17.1/compilable/extra-files/ddoc9369.html
dmd-testsuite-ldc-v0.17.1/compilable/extra-files/ddoc9475.html
dmd-testsuite-ldc-v0.17.1/compilable/extra-files/ddoc9497a.ddoc
dmd-testsuite-ldc-v0.17.1/compilable/extra-files/ddoc9497a.html
dmd-testsuite-ldc-v0.17.1/compilable/extra-files/ddoc9497b.ddoc
dmd-testsuite-ldc-v0.17.1/compilable/extra-files/ddoc9497b.html
dmd-testsuite-ldc-v0.17.1/compilable/extra-files/ddoc9497c.ddoc
dmd-testsuite-ldc-v0.17.1/compilable/extra-files/ddoc9497c.html
dmd-testsuite-ldc-v0.17.1/compilable/extra-files/ddoc9497d.ddoc
dmd-testsuite-ldc-v0.17.1/compilable/extra-files/ddoc9497d.html
dmd-testsuite-ldc-v0.17.1/compilable/extra-files/ddoc9676a.ddoc
dmd-testsuite-ldc-v0.17.1/compilable/extra-files/ddoc9676a.html
dmd-testsuite-ldc-v0.17.1/compilable/extra-files/ddoc9676b.html
dmd-testsuite-ldc-v0.17.1/compilable/extra-files/ddoc9727.html
dmd-testsuite-ldc-v0.17.1/compilable/extra-files/ddoc9764.dd
dmd-testsuite-ldc-v0.17.1/compilable/extra-files/ddoc9764.html
dmd-testsuite-ldc-v0.17.1/compilable/extra-files/ddoc9789.html
dmd-testsuite-ldc-v0.17.1/compilable/extra-files/ddoc9903.html
dmd-testsuite-ldc-v0.17.1/compilable/extra-files/ddocAny-postscript.sh
dmd-testsuite-ldc-v0.17.1/compilable/extra-files/ddocYear-postscript.sh
dmd-testsuite-ldc-v0.17.1/compilable/extra-files/ddocYear.html
dmd-testsuite-ldc-v0.17.1/compilable/extra-files/ddocbackticks.html
dmd-testsuite-ldc-v0.17.1/compilable/extra-files/ddocunittest.html
dmd-testsuite-ldc-v0.17.1/compilable/extra-files/depsOutput.sh
dmd-testsuite-ldc-v0.17.1/compilable/extra-files/depsOutput9948a.d
dmd-testsuite-ldc-v0.17.1/compilable/extra-files/example7190/
dmd-testsuite-ldc-v0.17.1/compilable/extra-files/example7190/controllers/
dmd-testsuite-ldc-v0.17.1/compilable/extra-files/example7190/controllers/HomeController.d
dmd-testsuite-ldc-v0.17.1/compilable/extra-files/example7190/models/
dmd-testsuite-ldc-v0.17.1/compilable/extra-files/example7190/models/HomeModel.d
dmd-testsuite-ldc-v0.17.1/compilable/extra-files/header-postscript.sh
dmd-testsuite-ldc-v0.17.1/compilable/extra-files/header1.d
dmd-testsuite-ldc-v0.17.1/compilable/extra-files/header1.di
dmd-testsuite-ldc-v0.17.1/compilable/extra-files/header12567a.di
dmd-testsuite-ldc-v0.17.1/compilable/extra-files/header12567b.di
dmd-testsuite-ldc-v0.17.1/compilable/extra-files/header1i.di
dmd-testsuite-ldc-v0.17.1/compilable/extra-files/header2.d
dmd-testsuite-ldc-v0.17.1/compilable/extra-files/header2.di
dmd-testsuite-ldc-v0.17.1/compilable/extra-files/header2i.di
dmd-testsuite-ldc-v0.17.1/compilable/extra-files/imp9057.d
dmd-testsuite-ldc-v0.17.1/compilable/extra-files/imp9057_2.d
dmd-testsuite-ldc-v0.17.1/compilable/extra-files/json-postscript.sh
dmd-testsuite-ldc-v0.17.1/compilable/extra-files/json.out
dmd-testsuite-ldc-v0.17.1/compilable/extra-files/pkgDIP37/
dmd-testsuite-ldc-v0.17.1/compilable/extra-files/pkgDIP37/datetime/
dmd-testsuite-ldc-v0.17.1/compilable/extra-files/pkgDIP37/datetime/common.d
dmd-testsuite-ldc-v0.17.1/compilable/extra-files/pkgDIP37/datetime/package.d
dmd-testsuite-ldc-v0.17.1/compilable/extra-files/pkgDIP37_10302/
dmd-testsuite-ldc-v0.17.1/compilable/extra-files/pkgDIP37_10302/liba.d
dmd-testsuite-ldc-v0.17.1/compilable/extra-files/pkgDIP37_10302/libb.d
dmd-testsuite-ldc-v0.17.1/compilable/extra-files/pkgDIP37_10302/package.d
dmd-testsuite-ldc-v0.17.1/compilable/extra-files/pkgDIP37_10354/
dmd-testsuite-ldc-v0.17.1/compilable/extra-files/pkgDIP37_10354/mbar.d
dmd-testsuite-ldc-v0.17.1/compilable/extra-files/pkgDIP37_10354/mfoo.d
dmd-testsuite-ldc-v0.17.1/compilable/extra-files/pkgDIP37_10354/package.d
dmd-testsuite-ldc-v0.17.1/compilable/extra-files/pkgDIP37_10421/
dmd-testsuite-ldc-v0.17.1/compilable/extra-files/pkgDIP37_10421/algo/
dmd-testsuite-ldc-v0.17.1/compilable/extra-files/pkgDIP37_10421/algo/mod.d
dmd-testsuite-ldc-v0.17.1/compilable/extra-files/pkgDIP37_10421/algo/package.d
dmd-testsuite-ldc-v0.17.1/compilable/extra-files/pkgDIP37_10421/except.d
dmd-testsuite-ldc-v0.17.1/compilable/extra-files/serenity7190/
dmd-testsuite-ldc-v0.17.1/compilable/extra-files/serenity7190/core/
dmd-testsuite-ldc-v0.17.1/compilable/extra-files/serenity7190/core/Controller.d
dmd-testsuite-ldc-v0.17.1/compilable/extra-files/serenity7190/core/Model.d
dmd-testsuite-ldc-v0.17.1/compilable/extra-files/test11237.sh
dmd-testsuite-ldc-v0.17.1/compilable/extra-files/test14894a.d
dmd-testsuite-ldc-v0.17.1/compilable/extra-files/test14894main.d
dmd-testsuite-ldc-v0.17.1/compilable/extra-files/test6461/
dmd-testsuite-ldc-v0.17.1/compilable/extra-files/test6461/a.d
dmd-testsuite-ldc-v0.17.1/compilable/extra-files/test6461/b.d
dmd-testsuite-ldc-v0.17.1/compilable/extra-files/test6461/main.d
dmd-testsuite-ldc-v0.17.1/compilable/extra-files/test6461/tmpl.d
dmd-testsuite-ldc-v0.17.1/compilable/extra-files/test7754-postscript.sh
dmd-testsuite-ldc-v0.17.1/compilable/extra-files/test7754.di
dmd-testsuite-ldc-v0.17.1/compilable/extra-files/test9680dllmain.d
dmd-testsuite-ldc-v0.17.1/compilable/extra-files/test9680main.d
dmd-testsuite-ldc-v0.17.1/compilable/extra-files/test9680winmain.d
dmd-testsuite-ldc-v0.17.1/compilable/extra-files/testheaderudamodule.di
dmd-testsuite-ldc-v0.17.1/compilable/fail260.d
dmd-testsuite-ldc-v0.17.1/compilable/forward1.d
dmd-testsuite-ldc-v0.17.1/compilable/iasm_labeloperand.d
dmd-testsuite-ldc-v0.17.1/compilable/ice10040.d
dmd-testsuite-ldc-v0.17.1/compilable/ice10431a.d
dmd-testsuite-ldc-v0.17.1/compilable/ice10431b.d
dmd-testsuite-ldc-v0.17.1/compilable/ice10486.d
dmd-testsuite-ldc-v0.17.1/compilable/ice10598.d
dmd-testsuite-ldc-v0.17.1/compilable/ice11054.d
dmd-testsuite-ldc-v0.17.1/compilable/ice11596.d
dmd-testsuite-ldc-v0.17.1/compilable/ice11610.d
dmd-testsuite-ldc-v0.17.1/compilable/ice11777.d
dmd-testsuite-ldc-v0.17.1/compilable/ice11906.d
dmd-testsuite-ldc-v0.17.1/compilable/ice11925.d
dmd-testsuite-ldc-v0.17.1/compilable/ice12002.d
dmd-testsuite-ldc-v0.17.1/compilable/ice12554.d
dmd-testsuite-ldc-v0.17.1/compilable/ice12956.d
dmd-testsuite-ldc-v0.17.1/compilable/ice13071.d
dmd-testsuite-ldc-v0.17.1/compilable/ice13088.d
dmd-testsuite-ldc-v0.17.1/compilable/ice13245.d
dmd-testsuite-ldc-v0.17.1/compilable/ice13323.d
dmd-testsuite-ldc-v0.17.1/compilable/ice13403.d
dmd-testsuite-ldc-v0.17.1/compilable/ice13874.d
dmd-testsuite-ldc-v0.17.1/compilable/ice13886.d
dmd-testsuite-ldc-v0.17.1/compilable/ice13920.d
dmd-testsuite-ldc-v0.17.1/compilable/ice13968.d
dmd-testsuite-ldc-v0.17.1/compilable/ice14075.d
dmd-testsuite-ldc-v0.17.1/compilable/ice1524.d
dmd-testsuite-ldc-v0.17.1/compilable/ice6538.d
dmd-testsuite-ldc-v0.17.1/compilable/ice8392.d
dmd-testsuite-ldc-v0.17.1/compilable/ice854.d
dmd-testsuite-ldc-v0.17.1/compilable/ice9663.d
dmd-testsuite-ldc-v0.17.1/compilable/imports/
dmd-testsuite-ldc-v0.17.1/compilable/imports/a12506.d
dmd-testsuite-ldc-v0.17.1/compilable/imports/a12567.d
dmd-testsuite-ldc-v0.17.1/compilable/imports/a13226.d
dmd-testsuite-ldc-v0.17.1/compilable/imports/a14528.d
dmd-testsuite-ldc-v0.17.1/compilable/imports/a8392.d
dmd-testsuite-ldc-v0.17.1/compilable/imports/art4769a.d
dmd-testsuite-ldc-v0.17.1/compilable/imports/art4769b.d
dmd-testsuite-ldc-v0.17.1/compilable/imports/b33a.d
dmd-testsuite-ldc-v0.17.1/compilable/imports/b3682.d
dmd-testsuite-ldc-v0.17.1/compilable/imports/bug8922.d
dmd-testsuite-ldc-v0.17.1/compilable/imports/defaa.d
dmd-testsuite-ldc-v0.17.1/compilable/imports/defab.d
dmd-testsuite-ldc-v0.17.1/compilable/imports/defac.d
dmd-testsuite-ldc-v0.17.1/compilable/imports/defad.d
dmd-testsuite-ldc-v0.17.1/compilable/imports/fwdref12201a.d
dmd-testsuite-ldc-v0.17.1/compilable/imports/fwdref9514.d
dmd-testsuite-ldc-v0.17.1/compilable/imports/ice10598a.d
dmd-testsuite-ldc-v0.17.1/compilable/imports/ice10598b.d
dmd-testsuite-ldc-v0.17.1/compilable/imports/ice11054a.d
dmd-testsuite-ldc-v0.17.1/compilable/imports/ice13403a.d
dmd-testsuite-ldc-v0.17.1/compilable/imports/imp12242a.d
dmd-testsuite-ldc-v0.17.1/compilable/imports/imp12242a1.d
dmd-testsuite-ldc-v0.17.1/compilable/imports/imp12242a2.d
dmd-testsuite-ldc-v0.17.1/compilable/imports/imp12242b.d
dmd-testsuite-ldc-v0.17.1/compilable/imports/imp12242b1.d
dmd-testsuite-ldc-v0.17.1/compilable/imports/imp12242b2.d
dmd-testsuite-ldc-v0.17.1/compilable/imports/jsonimport1.d
dmd-testsuite-ldc-v0.17.1/compilable/imports/jsonimport2.d
dmd-testsuite-ldc-v0.17.1/compilable/imports/jsonimport3.d
dmd-testsuite-ldc-v0.17.1/compilable/imports/jsonimport4.d
dmd-testsuite-ldc-v0.17.1/compilable/imports/ldc_github_247a.d
dmd-testsuite-ldc-v0.17.1/compilable/imports/ldc_github_662b.d
dmd-testsuite-ldc-v0.17.1/compilable/imports/ldc_github_662c.d
dmd-testsuite-ldc-v0.17.1/compilable/imports/ldc_github_662d.d
dmd-testsuite-ldc-v0.17.1/compilable/imports/ldc_github_739a.d
dmd-testsuite-ldc-v0.17.1/compilable/imports/ldc_github_739b.d
dmd-testsuite-ldc-v0.17.1/compilable/imports/ldc_github_821a.d
dmd-testsuite-ldc-v0.17.1/compilable/imports/protectionimp.d
dmd-testsuite-ldc-v0.17.1/compilable/imports/stdio4003.d
dmd-testsuite-ldc-v0.17.1/compilable/imports/test10375a.d
dmd-testsuite-ldc-v0.17.1/compilable/imports/test10752.d
dmd-testsuite-ldc-v0.17.1/compilable/imports/test11225b.d
dmd-testsuite-ldc-v0.17.1/compilable/imports/test11225c.d
dmd-testsuite-ldc-v0.17.1/compilable/imports/test11563core_bitop.d
dmd-testsuite-ldc-v0.17.1/compilable/imports/test11563std_array.d
dmd-testsuite-ldc-v0.17.1/compilable/imports/test11563std_range.d
dmd-testsuite-ldc-v0.17.1/compilable/imports/test11563std_traits.d
dmd-testsuite-ldc-v0.17.1/compilable/imports/test14666a.d
dmd-testsuite-ldc-v0.17.1/compilable/imports/test14666b.d
dmd-testsuite-ldc-v0.17.1/compilable/imports/test1imp.d
dmd-testsuite-ldc-v0.17.1/compilable/imports/test25a.d
dmd-testsuite-ldc-v0.17.1/compilable/imports/test25b.d
dmd-testsuite-ldc-v0.17.1/compilable/imports/test4003a.d
dmd-testsuite-ldc-v0.17.1/compilable/imports/test50a.d
dmd-testsuite-ldc-v0.17.1/compilable/imports/test55a.d
dmd-testsuite-ldc-v0.17.1/compilable/imports/test59a.d
dmd-testsuite-ldc-v0.17.1/compilable/imports/test59b.d
dmd-testsuite-ldc-v0.17.1/compilable/imports/test6013.d
dmd-testsuite-ldc-v0.17.1/compilable/imports/test61a.d
dmd-testsuite-ldc-v0.17.1/compilable/imports/test62a.d
dmd-testsuite-ldc-v0.17.1/compilable/imports/test63a.d
dmd-testsuite-ldc-v0.17.1/compilable/imports/test66a.d
dmd-testsuite-ldc-v0.17.1/compilable/imports/test67a.d
dmd-testsuite-ldc-v0.17.1/compilable/imports/test68a.d
dmd-testsuite-ldc-v0.17.1/compilable/imports/test70.d
dmd-testsuite-ldc-v0.17.1/compilable/imports/test71.d
dmd-testsuite-ldc-v0.17.1/compilable/imports/test72a.d
dmd-testsuite-ldc-v0.17.1/compilable/imports/test72b.d
dmd-testsuite-ldc-v0.17.1/compilable/imports/test72c.d
dmd-testsuite-ldc-v0.17.1/compilable/imports/test7491a.d
dmd-testsuite-ldc-v0.17.1/compilable/imports/test7491b.d
dmd-testsuite-ldc-v0.17.1/compilable/imports/test9276decl.d
dmd-testsuite-ldc-v0.17.1/compilable/imports/test9276expr.d
dmd-testsuite-ldc-v0.17.1/compilable/imports/test9276hash.d
dmd-testsuite-ldc-v0.17.1/compilable/imports/test9276parser.d
dmd-testsuite-ldc-v0.17.1/compilable/imports/test9276sem.d
dmd-testsuite-ldc-v0.17.1/compilable/imports/test9276type.d
dmd-testsuite-ldc-v0.17.1/compilable/imports/test9276util.d
dmd-testsuite-ldc-v0.17.1/compilable/imports/test9276visitors.d
dmd-testsuite-ldc-v0.17.1/compilable/imports/test9399a.d
dmd-testsuite-ldc-v0.17.1/compilable/imports/test9436aggr.d
dmd-testsuite-ldc-v0.17.1/compilable/imports/test9436interp.d
dmd-testsuite-ldc-v0.17.1/compilable/imports/test9436node.d
dmd-testsuite-ldc-v0.17.1/compilable/imports/test9436type.d
dmd-testsuite-ldc-v0.17.1/compilable/imports/test9672a.d
dmd-testsuite-ldc-v0.17.1/compilable/imports/test9692b.d
dmd-testsuite-ldc-v0.17.1/compilable/imports/test9919a.d
dmd-testsuite-ldc-v0.17.1/compilable/imports/test9919b.d
dmd-testsuite-ldc-v0.17.1/compilable/imports/test9919c.d
dmd-testsuite-ldc-v0.17.1/compilable/imports/testcov1a.d
dmd-testsuite-ldc-v0.17.1/compilable/imports/testcov1b.d
dmd-testsuite-ldc-v0.17.1/compilable/imports/typecons4003.d
dmd-testsuite-ldc-v0.17.1/compilable/imports/udamodule1.d
dmd-testsuite-ldc-v0.17.1/compilable/imports/udamodule2.d
dmd-testsuite-ldc-v0.17.1/compilable/imports/udamodule2a.d
dmd-testsuite-ldc-v0.17.1/compilable/interpret3.d
dmd-testsuite-ldc-v0.17.1/compilable/json.d
dmd-testsuite-ldc-v0.17.1/compilable/ldc_aggregate.d
dmd-testsuite-ldc-v0.17.1/compilable/ldc_github_1211.d
dmd-testsuite-ldc-v0.17.1/compilable/ldc_github_1292.d
dmd-testsuite-ldc-v0.17.1/compilable/ldc_github_1308.d
dmd-testsuite-ldc-v0.17.1/compilable/ldc_github_247.d
dmd-testsuite-ldc-v0.17.1/compilable/ldc_github_256.d
dmd-testsuite-ldc-v0.17.1/compilable/ldc_github_257.d
dmd-testsuite-ldc-v0.17.1/compilable/ldc_github_266.d
dmd-testsuite-ldc-v0.17.1/compilable/ldc_github_355.d
dmd-testsuite-ldc-v0.17.1/compilable/ldc_github_378.d
dmd-testsuite-ldc-v0.17.1/compilable/ldc_github_419.d
dmd-testsuite-ldc-v0.17.1/compilable/ldc_github_421.d
dmd-testsuite-ldc-v0.17.1/compilable/ldc_github_454.d
dmd-testsuite-ldc-v0.17.1/compilable/ldc_github_461.d
dmd-testsuite-ldc-v0.17.1/compilable/ldc_github_497.d
dmd-testsuite-ldc-v0.17.1/compilable/ldc_github_637.d
dmd-testsuite-ldc-v0.17.1/compilable/ldc_github_662.d
dmd-testsuite-ldc-v0.17.1/compilable/ldc_github_739.d
dmd-testsuite-ldc-v0.17.1/compilable/ldc_github_791.d
dmd-testsuite-ldc-v0.17.1/compilable/ldc_github_821.d
dmd-testsuite-ldc-v0.17.1/compilable/ldc_github_823.d
dmd-testsuite-ldc-v0.17.1/compilable/ldc_github_841.d
dmd-testsuite-ldc-v0.17.1/compilable/ldc_github_965.d
dmd-testsuite-ldc-v0.17.1/compilable/ldc_github_982.d
dmd-testsuite-ldc-v0.17.1/compilable/line.d
dmd-testsuite-ldc-v0.17.1/compilable/nogc.d
dmd-testsuite-ldc-v0.17.1/compilable/protattr.d
dmd-testsuite-ldc-v0.17.1/compilable/protection.d
dmd-testsuite-ldc-v0.17.1/compilable/protection/
dmd-testsuite-ldc-v0.17.1/compilable/protection/aggregate/
dmd-testsuite-ldc-v0.17.1/compilable/protection/aggregate/mod14275.d
dmd-testsuite-ldc-v0.17.1/compilable/protection/basic/
dmd-testsuite-ldc-v0.17.1/compilable/protection/basic/mod1.d
dmd-testsuite-ldc-v0.17.1/compilable/protection/basic/tests.d
dmd-testsuite-ldc-v0.17.1/compilable/protection/bug/
dmd-testsuite-ldc-v0.17.1/compilable/protection/bug/bug14275.d
dmd-testsuite-ldc-v0.17.1/compilable/protection/subpkg/
dmd-testsuite-ldc-v0.17.1/compilable/protection/subpkg/explicit.d
dmd-testsuite-ldc-v0.17.1/compilable/protection/subpkg/tests.d
dmd-testsuite-ldc-v0.17.1/compilable/protection/subpkg2/
dmd-testsuite-ldc-v0.17.1/compilable/protection/subpkg2/tests.d
dmd-testsuite-ldc-v0.17.1/compilable/sw_transition_complex.d
dmd-testsuite-ldc-v0.17.1/compilable/sw_transition_field.d
dmd-testsuite-ldc-v0.17.1/compilable/sw_transition_tls.d
dmd-testsuite-ldc-v0.17.1/compilable/test1.d
dmd-testsuite-ldc-v0.17.1/compilable/test10056.d
dmd-testsuite-ldc-v0.17.1/compilable/test10066.d
dmd-testsuite-ldc-v0.17.1/compilable/test10073.d
dmd-testsuite-ldc-v0.17.1/compilable/test10186.d
dmd-testsuite-ldc-v0.17.1/compilable/test10312.d
dmd-testsuite-ldc-v0.17.1/compilable/test10375.d
dmd-testsuite-ldc-v0.17.1/compilable/test10520.d
dmd-testsuite-ldc-v0.17.1/compilable/test10695.d
dmd-testsuite-ldc-v0.17.1/compilable/test10726.d
dmd-testsuite-ldc-v0.17.1/compilable/test10752.d
dmd-testsuite-ldc-v0.17.1/compilable/test10981.d
dmd-testsuite-ldc-v0.17.1/compilable/test10992.d
dmd-testsuite-ldc-v0.17.1/compilable/test10992b.d
dmd-testsuite-ldc-v0.17.1/compilable/test10993.d
dmd-testsuite-ldc-v0.17.1/compilable/test11137.d
dmd-testsuite-ldc-v0.17.1/compilable/test11225a.d
dmd-testsuite-ldc-v0.17.1/compilable/test11237.d
dmd-testsuite-ldc-v0.17.1/compilable/test11371.d
dmd-testsuite-ldc-v0.17.1/compilable/test11471.d
dmd-testsuite-ldc-v0.17.1/compilable/test11559upgradeoptlink.d
dmd-testsuite-ldc-v0.17.1/compilable/test11563.d
dmd-testsuite-ldc-v0.17.1/compilable/test11656.d
dmd-testsuite-ldc-v0.17.1/compilable/test11824.d
dmd-testsuite-ldc-v0.17.1/compilable/test11914.d
dmd-testsuite-ldc-v0.17.1/compilable/test11980.d
dmd-testsuite-ldc-v0.17.1/compilable/test12009.d
dmd-testsuite-ldc-v0.17.1/compilable/test12523.d
dmd-testsuite-ldc-v0.17.1/compilable/test12567a.d
dmd-testsuite-ldc-v0.17.1/compilable/test12567b.d
dmd-testsuite-ldc-v0.17.1/compilable/test12567c.d
dmd-testsuite-ldc-v0.17.1/compilable/test12567d.d
dmd-testsuite-ldc-v0.17.1/compilable/test12593.d
dmd-testsuite-ldc-v0.17.1/compilable/test12967.d
dmd-testsuite-ldc-v0.17.1/compilable/test12979a.d
dmd-testsuite-ldc-v0.17.1/compilable/test12979b.d
dmd-testsuite-ldc-v0.17.1/compilable/test13008.d
dmd-testsuite-ldc-v0.17.1/compilable/test13053.d
dmd-testsuite-ldc-v0.17.1/compilable/test13193.d
dmd-testsuite-ldc-v0.17.1/compilable/test13194.d
dmd-testsuite-ldc-v0.17.1/compilable/test13226.d
dmd-testsuite-ldc-v0.17.1/compilable/test13281.d
dmd-testsuite-ldc-v0.17.1/compilable/test1353.d
dmd-testsuite-ldc-v0.17.1/compilable/test13600.d
dmd-testsuite-ldc-v0.17.1/compilable/test13668.d
dmd-testsuite-ldc-v0.17.1/compilable/test13858.d
dmd-testsuite-ldc-v0.17.1/compilable/test13902.d
dmd-testsuite-ldc-v0.17.1/compilable/test14275.d
dmd-testsuite-ldc-v0.17.1/compilable/test14317.d
dmd-testsuite-ldc-v0.17.1/compilable/test14375.d
dmd-testsuite-ldc-v0.17.1/compilable/test14528.d
dmd-testsuite-ldc-v0.17.1/compilable/test14666.d
dmd-testsuite-ldc-v0.17.1/compilable/test14781.d
dmd-testsuite-ldc-v0.17.1/compilable/test14838.d
dmd-testsuite-ldc-v0.17.1/compilable/test14894.sh
dmd-testsuite-ldc-v0.17.1/compilable/test14962.d
dmd-testsuite-ldc-v0.17.1/compilable/test14973.d
dmd-testsuite-ldc-v0.17.1/compilable/test15056.d
dmd-testsuite-ldc-v0.17.1/compilable/test1537.d
dmd-testsuite-ldc-v0.17.1/compilable/test1673.d
dmd-testsuite-ldc-v0.17.1/compilable/test1878a.d
dmd-testsuite-ldc-v0.17.1/compilable/test25.d
dmd-testsuite-ldc-v0.17.1/compilable/test3673.d
dmd-testsuite-ldc-v0.17.1/compilable/test3775.d
dmd-testsuite-ldc-v0.17.1/compilable/test4003.d
dmd-testsuite-ldc-v0.17.1/compilable/test4090.d
dmd-testsuite-ldc-v0.17.1/compilable/test4364.d
dmd-testsuite-ldc-v0.17.1/compilable/test4375.d
dmd-testsuite-ldc-v0.17.1/compilable/test50.d
dmd-testsuite-ldc-v0.17.1/compilable/test55.d
dmd-testsuite-ldc-v0.17.1/compilable/test59.d
dmd-testsuite-ldc-v0.17.1/compilable/test6013.d
dmd-testsuite-ldc-v0.17.1/compilable/test602.d
dmd-testsuite-ldc-v0.17.1/compilable/test6056a.d
dmd-testsuite-ldc-v0.17.1/compilable/test6056b.d
dmd-testsuite-ldc-v0.17.1/compilable/test6056c.d
dmd-testsuite-ldc-v0.17.1/compilable/test6089.d
dmd-testsuite-ldc-v0.17.1/compilable/test61.d
dmd-testsuite-ldc-v0.17.1/compilable/test62.d
dmd-testsuite-ldc-v0.17.1/compilable/test63.d
dmd-testsuite-ldc-v0.17.1/compilable/test6319.d
dmd-testsuite-ldc-v0.17.1/compilable/test6395.d
dmd-testsuite-ldc-v0.17.1/compilable/test6461.sh
dmd-testsuite-ldc-v0.17.1/compilable/test6534.d
dmd-testsuite-ldc-v0.17.1/compilable/test6552.d
dmd-testsuite-ldc-v0.17.1/compilable/test66.d
dmd-testsuite-ldc-v0.17.1/compilable/test67.d
dmd-testsuite-ldc-v0.17.1/compilable/test68.d
dmd-testsuite-ldc-v0.17.1/compilable/test69.d
dmd-testsuite-ldc-v0.17.1/compilable/test6999.d
dmd-testsuite-ldc-v0.17.1/compilable/test70.d
dmd-testsuite-ldc-v0.17.1/compilable/test7030.d
dmd-testsuite-ldc-v0.17.1/compilable/test7065.d
dmd-testsuite-ldc-v0.17.1/compilable/test71.d
dmd-testsuite-ldc-v0.17.1/compilable/test7172.d
dmd-testsuite-ldc-v0.17.1/compilable/test7190.d
dmd-testsuite-ldc-v0.17.1/compilable/test72.d
dmd-testsuite-ldc-v0.17.1/compilable/test7252.d
dmd-testsuite-ldc-v0.17.1/compilable/test7399.d
dmd-testsuite-ldc-v0.17.1/compilable/test7491.d
dmd-testsuite-ldc-v0.17.1/compilable/test7524.d
dmd-testsuite-ldc-v0.17.1/compilable/test7569.d
dmd-testsuite-ldc-v0.17.1/compilable/test7754.d
dmd-testsuite-ldc-v0.17.1/compilable/test8038.d
dmd-testsuite-ldc-v0.17.1/compilable/test8041.d
dmd-testsuite-ldc-v0.17.1/compilable/test8296.d
dmd-testsuite-ldc-v0.17.1/compilable/test8509.d
dmd-testsuite-ldc-v0.17.1/compilable/test8513.d
dmd-testsuite-ldc-v0.17.1/compilable/test8543.d
dmd-testsuite-ldc-v0.17.1/compilable/test8631.d
dmd-testsuite-ldc-v0.17.1/compilable/test8675.d
dmd-testsuite-ldc-v0.17.1/compilable/test8696.d
dmd-testsuite-ldc-v0.17.1/compilable/test8717.d
dmd-testsuite-ldc-v0.17.1/compilable/test8802.d
dmd-testsuite-ldc-v0.17.1/compilable/test8898.d
dmd-testsuite-ldc-v0.17.1/compilable/test8922a.d
dmd-testsuite-ldc-v0.17.1/compilable/test8922b.d
dmd-testsuite-ldc-v0.17.1/compilable/test8922c.d
dmd-testsuite-ldc-v0.17.1/compilable/test8922d.d
dmd-testsuite-ldc-v0.17.1/compilable/test8922e.d
dmd-testsuite-ldc-v0.17.1/compilable/test8922f.d
dmd-testsuite-ldc-v0.17.1/compilable/test8937.d
dmd-testsuite-ldc-v0.17.1/compilable/test8959.d
dmd-testsuite-ldc-v0.17.1/compilable/test9057.d
dmd-testsuite-ldc-v0.17.1/compilable/test9209.d
dmd-testsuite-ldc-v0.17.1/compilable/test9276.d
dmd-testsuite-ldc-v0.17.1/compilable/test9278a.d
dmd-testsuite-ldc-v0.17.1/compilable/test9278b.d
dmd-testsuite-ldc-v0.17.1/compilable/test9369.d
dmd-testsuite-ldc-v0.17.1/compilable/test9399.d
dmd-testsuite-ldc-v0.17.1/compilable/test9434.d
dmd-testsuite-ldc-v0.17.1/compilable/test9435.d
dmd-testsuite-ldc-v0.17.1/compilable/test9436.d
dmd-testsuite-ldc-v0.17.1/compilable/test9526.d
dmd-testsuite-ldc-v0.17.1/compilable/test9554.d
dmd-testsuite-ldc-v0.17.1/compilable/test9565.d
dmd-testsuite-ldc-v0.17.1/compilable/test9570.d
dmd-testsuite-ldc-v0.17.1/compilable/test9613.d
dmd-testsuite-ldc-v0.17.1/compilable/test9639.d
dmd-testsuite-ldc-v0.17.1/compilable/test9672.d
dmd-testsuite-ldc-v0.17.1/compilable/test9680.sh
dmd-testsuite-ldc-v0.17.1/compilable/test9692.d
dmd-testsuite-ldc-v0.17.1/compilable/test9692a.d
dmd-testsuite-ldc-v0.17.1/compilable/test9818.d
dmd-testsuite-ldc-v0.17.1/compilable/test9919.d
dmd-testsuite-ldc-v0.17.1/compilable/testDIP37.d
dmd-testsuite-ldc-v0.17.1/compilable/testDIP37_10302.d
dmd-testsuite-ldc-v0.17.1/compilable/testDIP37_10354.d
dmd-testsuite-ldc-v0.17.1/compilable/testDIP37_10421.d
dmd-testsuite-ldc-v0.17.1/compilable/testDIP37a.d
dmd-testsuite-ldc-v0.17.1/compilable/testDIP42.d
dmd-testsuite-ldc-v0.17.1/compilable/testInference.d
dmd-testsuite-ldc-v0.17.1/compilable/testVRP.d
dmd-testsuite-ldc-v0.17.1/compilable/testcov1.d
dmd-testsuite-ldc-v0.17.1/compilable/testexpression.d
dmd-testsuite-ldc-v0.17.1/compilable/testfptr.d
dmd-testsuite-ldc-v0.17.1/compilable/testfwdref.d
dmd-testsuite-ldc-v0.17.1/compilable/testheader1.d
dmd-testsuite-ldc-v0.17.1/compilable/testheader12567a.d
dmd-testsuite-ldc-v0.17.1/compilable/testheader12567b.d
dmd-testsuite-ldc-v0.17.1/compilable/testheader1i.d
dmd-testsuite-ldc-v0.17.1/compilable/testheader2.d
dmd-testsuite-ldc-v0.17.1/compilable/testheader2i.d
dmd-testsuite-ldc-v0.17.1/compilable/testheaderudamodule.d
dmd-testsuite-ldc-v0.17.1/compilable/testimport12242.d
dmd-testsuite-ldc-v0.17.1/compilable/testlibmain.d
dmd-testsuite-ldc-v0.17.1/compilable/testparse.d
dmd-testsuite-ldc-v0.17.1/compilable/testpostblit.d
dmd-testsuite-ldc-v0.17.1/compilable/testprofile.d
dmd-testsuite-ldc-v0.17.1/compilable/udamodule1.d
dmd-testsuite-ldc-v0.17.1/compilable/udamodule2.d
dmd-testsuite-ldc-v0.17.1/compilable/vgc1.d
dmd-testsuite-ldc-v0.17.1/compilable/vgc2.d
dmd-testsuite-ldc-v0.17.1/compilable/vgc3.d
dmd-testsuite-ldc-v0.17.1/compilable/warn3882.d
dmd-testsuite-ldc-v0.17.1/d_do_test.d
dmd-testsuite-ldc-v0.17.1/do_test.sh
dmd-testsuite-ldc-v0.17.1/fail_compilation/
dmd-testsuite-ldc-v0.17.1/fail_compilation/aacmp10381.d
dmd-testsuite-ldc-v0.17.1/fail_compilation/b3841.d
dmd-testsuite-ldc-v0.17.1/fail_compilation/bug4283.d
dmd-testsuite-ldc-v0.17.1/fail_compilation/bug5.d
dmd-testsuite-ldc-v0.17.1/fail_compilation/bug5b.d
dmd-testsuite-ldc-v0.17.1/fail_compilation/bug8150a.d
dmd-testsuite-ldc-v0.17.1/fail_compilation/bug8150b.d
dmd-testsuite-ldc-v0.17.1/fail_compilation/bug8891.d
dmd-testsuite-ldc-v0.17.1/fail_compilation/circ10280.d
dmd-testsuite-ldc-v0.17.1/fail_compilation/class1.d
dmd-testsuite-ldc-v0.17.1/fail_compilation/class2.d
dmd-testsuite-ldc-v0.17.1/fail_compilation/ctfe10989.d
dmd-testsuite-ldc-v0.17.1/fail_compilation/ctfe10995.d
dmd-testsuite-ldc-v0.17.1/fail_compilation/ctfe11467.d
dmd-testsuite-ldc-v0.17.1/fail_compilation/ctfe13612.d
dmd-testsuite-ldc-v0.17.1/fail_compilation/ctfe14207.d
dmd-testsuite-ldc-v0.17.1/fail_compilation/ctfe14465.d
dmd-testsuite-ldc-v0.17.1/fail_compilation/ctfe14731.d
dmd-testsuite-ldc-v0.17.1/fail_compilation/depmsg.d
dmd-testsuite-ldc-v0.17.1/fail_compilation/deprecate12979a.d
dmd-testsuite-ldc-v0.17.1/fail_compilation/deprecate12979b.d
dmd-testsuite-ldc-v0.17.1/fail_compilation/deprecate12979c.d
dmd-testsuite-ldc-v0.17.1/fail_compilation/deprecate12979d.d
dmd-testsuite-ldc-v0.17.1/fail_compilation/deprecate1553.d
dmd-testsuite-ldc-v0.17.1/fail_compilation/diag10089.d
dmd-testsuite-ldc-v0.17.1/fail_compilation/diag10099.d
dmd-testsuite-ldc-v0.17.1/fail_compilation/diag10141.d
dmd-testsuite-ldc-v0.17.1/fail_compilation/diag10169.d
dmd-testsuite-ldc-v0.17.1/fail_compilation/diag10221.d
dmd-testsuite-ldc-v0.17.1/fail_compilation/diag10221a.d
dmd-testsuite-ldc-v0.17.1/fail_compilation/diag10319.d
dmd-testsuite-ldc-v0.17.1/fail_compilation/diag10327.d
dmd-testsuite-ldc-v0.17.1/fail_compilation/diag10359.d
dmd-testsuite-ldc-v0.17.1/fail_compilation/diag10405.d
dmd-testsuite-ldc-v0.17.1/fail_compilation/diag10415.d
dmd-testsuite-ldc-v0.17.1/fail_compilation/diag10688.d
dmd-testsuite-ldc-v0.17.1/fail_compilation/diag10783.d
dmd-testsuite-ldc-v0.17.1/fail_compilation/diag10792.d
dmd-testsuite-ldc-v0.17.1/fail_compilation/diag10805.d
dmd-testsuite-ldc-v0.17.1/fail_compilation/diag10862.d
dmd-testsuite-ldc-v0.17.1/fail_compilation/diag10926.d
dmd-testsuite-ldc-v0.17.1/fail_compilation/diag10984.d
dmd-testsuite-ldc-v0.17.1/fail_compilation/diag11078.d
dmd-testsuite-ldc-v0.17.1/fail_compilation/diag11088.d
dmd-testsuite-ldc-v0.17.1/fail_compilation/diag11132.d
dmd-testsuite-ldc-v0.17.1/fail_compilation/diag11198.d
dmd-testsuite-ldc-v0.17.1/fail_compilation/diag11423.d
dmd-testsuite-ldc-v0.17.1/fail_compilation/diag11425.d
dmd-testsuite-ldc-v0.17.1/fail_compilation/diag11727.d
dmd-testsuite-ldc-v0.17.1/fail_compilation/diag11756.d
dmd-testsuite-ldc-v0.17.1/fail_compilation/diag11759.d
dmd-testsuite-ldc-v0.17.1/fail_compilation/diag11769.d
dmd-testsuite-ldc-v0.17.1/fail_compilation/diag11819a.d
dmd-testsuite-ldc-v0.17.1/fail_compilation/diag11819b.d
dmd-testsuite-ldc-v0.17.1/fail_compilation/diag11840.d
dmd-testsuite-ldc-v0.17.1/fail_compilation/diag12063.d
dmd-testsuite-ldc-v0.17.1/fail_compilation/diag12124.d
dmd-testsuite-ldc-v0.17.1/fail_compilation/diag12280.d
dmd-testsuite-ldc-v0.17.1/fail_compilation/diag12312.d
dmd-testsuite-ldc-v0.17.1/fail_compilation/diag12380.d
dmd-testsuite-ldc-v0.17.1/fail_compilation/diag12432.d
dmd-testsuite-ldc-v0.17.1/fail_compilation/diag12480.d
dmd-testsuite-ldc-v0.17.1/fail_compilation/diag12598.d
dmd-testsuite-ldc-v0.17.1/fail_compilation/diag12640.d
dmd-testsuite-ldc-v0.17.1/fail_compilation/diag12678.d
dmd-testsuite-ldc-v0.17.1/fail_compilation/diag12777.d
dmd-testsuite-ldc-v0.17.1/fail_compilation/diag13028.d
dmd-testsuite-ldc-v0.17.1/fail_compilation/diag13082.d
dmd-testsuite-ldc-v0.17.1/fail_compilation/diag13109.d
dmd-testsuite-ldc-v0.17.1/fail_compilation/diag13142.d
dmd-testsuite-ldc-v0.17.1/fail_compilation/diag13281.d
dmd-testsuite-ldc-v0.17.1/fail_compilation/diag13320.d
dmd-testsuite-ldc-v0.17.1/fail_compilation/diag13333.d
dmd-testsuite-ldc-v0.17.1/fail_compilation/diag13528.d
dmd-testsuite-ldc-v0.17.1/fail_compilation/diag13609a.d
dmd-testsuite-ldc-v0.17.1/fail_compilation/diag13609b.d
dmd-testsuite-ldc-v0.17.1/fail_compilation/diag13787.d
dmd-testsuite-ldc-v0.17.1/fail_compilation/diag13884.d
dmd-testsuite-ldc-v0.17.1/fail_compilation/diag13942.d
dmd-testsuite-ldc-v0.17.1/fail_compilation/diag14102.d
dmd-testsuite-ldc-v0.17.1/fail_compilation/diag14163.d
dmd-testsuite-ldc-v0.17.1/fail_compilation/diag14235.d
dmd-testsuite-ldc-v0.17.1/fail_compilation/diag1566.d
dmd-testsuite-ldc-v0.17.1/fail_compilation/diag1730.d
dmd-testsuite-ldc-v0.17.1/fail_compilation/diag2452.d
dmd-testsuite-ldc-v0.17.1/fail_compilation/diag3013.d
dmd-testsuite-ldc-v0.17.1/fail_compilation/diag3672.d
dmd-testsuite-ldc-v0.17.1/fail_compilation/diag3672a.d
dmd-testsuite-ldc-v0.17.1/fail_compilation/diag3673.d
dmd-testsuite-ldc-v0.17.1/fail_compilation/diag3869.d
dmd-testsuite-ldc-v0.17.1/fail_compilation/diag4479.d
dmd-testsuite-ldc-v0.17.1/fail_compilation/diag4528.d
dmd-testsuite-ldc-v0.17.1/fail_compilation/diag4540.d
dmd-testsuite-ldc-v0.17.1/fail_compilation/diag5385.d
dmd-testsuite-ldc-v0.17.1/fail_compilation/diag5450.d
dmd-testsuite-ldc-v0.17.1/fail_compilation/diag6373.d
dmd-testsuite-ldc-v0.17.1/fail_compilation/diag6539.d
dmd-testsuite-ldc-v0.17.1/fail_compilation/diag6677.d
dmd-testsuite-ldc-v0.17.1/fail_compilation/diag6699.d
dmd-testsuite-ldc-v0.17.1/fail_compilation/diag6707.d
dmd-testsuite-ldc-v0.17.1/fail_compilation/diag6717.d
dmd-testsuite-ldc-v0.17.1/fail_compilation/diag6743.d
dmd-testsuite-ldc-v0.17.1/fail_compilation/diag6796.d
dmd-testsuite-ldc-v0.17.1/fail_compilation/diag7050a.d
dmd-testsuite-ldc-v0.17.1/fail_compilation/diag7050b.d
dmd-testsuite-ldc-v0.17.1/fail_compilation/diag7050c.d
dmd-testsuite-ldc-v0.17.1/fail_compilation/diag7420.d
dmd-testsuite-ldc-v0.17.1/fail_compilation/diag7477.d
dmd-testsuite-ldc-v0.17.1/fail_compilation/diag7747.d
dmd-testsuite-ldc-v0.17.1/fail_compilation/diag7998.d
dmd-testsuite-ldc-v0.17.1/fail_compilation/diag8101.d
dmd-testsuite-ldc-v0.17.1/fail_compilation/diag8101b.d
dmd-testsuite-ldc-v0.17.1/fail_compilation/diag8178.d
dmd-testsuite-ldc-v0.17.1/fail_compilation/diag8318.d
dmd-testsuite-ldc-v0.17.1/fail_compilation/diag8425.d
dmd-testsuite-ldc-v0.17.1/fail_compilation/diag8510.d
dmd-testsuite-ldc-v0.17.1/fail_compilation/diag8559.d
dmd-testsuite-ldc-v0.17.1/fail_compilation/diag8629.d
dmd-testsuite-ldc-v0.17.1/fail_compilation/diag8648.d
dmd-testsuite-ldc-v0.17.1/fail_compilation/diag8697.d
dmd-testsuite-ldc-v0.17.1/fail_compilation/diag8714.d
dmd-testsuite-ldc-v0.17.1/fail_compilation/diag8777.d
dmd-testsuite-ldc-v0.17.1/fail_compilation/diag8787.d
dmd-testsuite-ldc-v0.17.1/fail_compilation/diag8825.d
dmd-testsuite-ldc-v0.17.1/fail_compilation/diag8892.d
dmd-testsuite-ldc-v0.17.1/fail_compilation/diag8894.d
dmd-testsuite-ldc-v0.17.1/fail_compilation/diag8928.d
dmd-testsuite-ldc-v0.17.1/fail_compilation/diag9004.d
dmd-testsuite-ldc-v0.17.1/fail_compilation/diag9148.d
dmd-testsuite-ldc-v0.17.1/fail_compilation/diag9191.d
dmd-testsuite-ldc-v0.17.1/fail_compilation/diag9210a.d
dmd-testsuite-ldc-v0.17.1/fail_compilation/diag9241.d
dmd-testsuite-ldc-v0.17.1/fail_compilation/diag9247.d
dmd-testsuite-ldc-v0.17.1/fail_compilation/diag9250.d
dmd-testsuite-ldc-v0.17.1/fail_compilation/diag9312.d
dmd-testsuite-ldc-v0.17.1/fail_compilation/diag9357.d
dmd-testsuite-ldc-v0.17.1/fail_compilation/diag9358.d
dmd-testsuite-ldc-v0.17.1/fail_compilation/diag9398.d
dmd-testsuite-ldc-v0.17.1/fail_compilation/diag9420.d
dmd-testsuite-ldc-v0.17.1/fail_compilation/diag9451.d
dmd-testsuite-ldc-v0.17.1/fail_compilation/diag9479.d
dmd-testsuite-ldc-v0.17.1/fail_compilation/diag9574.d
dmd-testsuite-ldc-v0.17.1/fail_compilation/diag9620.d
dmd-testsuite-ldc-v0.17.1/fail_compilation/diag9635.d
dmd-testsuite-ldc-v0.17.1/fail_compilation/diag9679.d
dmd-testsuite-ldc-v0.17.1/fail_compilation/diag9765.d
dmd-testsuite-ldc-v0.17.1/fail_compilation/diag9831.d
dmd-testsuite-ldc-v0.17.1/fail_compilation/diag9861.d
dmd-testsuite-ldc-v0.17.1/fail_compilation/diag9880.d
dmd-testsuite-ldc-v0.17.1/fail_compilation/diag9961.d
dmd-testsuite-ldc-v0.17.1/fail_compilation/diag_cstyle.d
dmd-testsuite-ldc-v0.17.1/fail_compilation/diag_err1.d
dmd-testsuite-ldc-v0.17.1/fail_compilation/enum9921.d
dmd-testsuite-ldc-v0.17.1/fail_compilation/extra-files/
dmd-testsuite-ldc-v0.17.1/fail_compilation/extra-files/a14446.d
dmd-testsuite-ldc-v0.17.1/fail_compilation/extra-files/bar11453.d
dmd-testsuite-ldc-v0.17.1/fail_compilation/extra-files/foo11453.d
dmd-testsuite-ldc-v0.17.1/fail_compilation/fail10.d
dmd-testsuite-ldc-v0.17.1/fail_compilation/fail100.d
dmd-testsuite-ldc-v0.17.1/fail_compilation/fail10082.d
dmd-testsuite-ldc-v0.17.1/fail_compilation/fail101.d
dmd-testsuite-ldc-v0.17.1/fail_compilation/fail10102.d
dmd-testsuite-ldc-v0.17.1/fail_compilation/fail10115.d
dmd-testsuite-ldc-v0.17.1/fail_compilation/fail10207.d
dmd-testsuite-ldc-v0.17.1/fail_compilation/fail10254.d
dmd-testsuite-ldc-v0.17.1/fail_compilation/fail10277.d
dmd-testsuite-ldc-v0.17.1/fail_compilation/fail10285.d
dmd-testsuite-ldc-v0.17.1/fail_compilation/fail10299.d
dmd-testsuite-ldc-v0.17.1/fail_compilation/fail10346.d
dmd-testsuite-ldc-v0.17.1/fail_compilation/fail104.d
dmd-testsuite-ldc-v0.17.1/fail_compilation/fail10439.d
dmd-testsuite-ldc-v0.17.1/fail_compilation/fail10481.d
dmd-testsuite-ldc-v0.17.1/fail_compilation/fail105.d
dmd-testsuite-ldc-v0.17.1/fail_compilation/fail10528.d
dmd-testsuite-ldc-v0.17.1/fail_compilation/fail10534.d
dmd-testsuite-ldc-v0.17.1/fail_compilation/fail106.d
dmd-testsuite-ldc-v0.17.1/fail_compilation/fail10630.d
dmd-testsuite-ldc-v0.17.1/fail_compilation/fail10666.d
dmd-testsuite-ldc-v0.17.1/fail_compilation/fail108.d
dmd-testsuite-ldc-v0.17.1/fail_compilation/fail109.d
dmd-testsuite-ldc-v0.17.1/fail_compilation/fail10905.d
dmd-testsuite-ldc-v0.17.1/fail_compilation/fail10947.d
dmd-testsuite-ldc-v0.17.1/fail_compilation/fail10964.d
dmd-testsuite-ldc-v0.17.1/fail_compilation/fail10968.d
dmd-testsuite-ldc-v0.17.1/fail_compilation/fail10980.d
dmd-testsuite-ldc-v0.17.1/fail_compilation/fail11.d
dmd-testsuite-ldc-v0.17.1/fail_compilation/fail110.d
dmd-testsuite-ldc-v0.17.1/fail_compilation/fail11042.d
dmd-testsuite-ldc-v0.17.1/fail_compilation/fail111.d
dmd-testsuite-ldc-v0.17.1/fail_compilation/fail11125.d
dmd-testsuite-ldc-v0.17.1/fail_compilation/fail11151.d
dmd-testsuite-ldc-v0.17.1/fail_compilation/fail11163.d
dmd-testsuite-ldc-v0.17.1/fail_compilation/fail113.d
dmd-testsuite-ldc-v0.17.1/fail_compilation/fail11355.d
dmd-testsuite-ldc-v0.17.1/fail_compilation/fail11375.d
dmd-testsuite-ldc-v0.17.1/fail_compilation/fail114.d
dmd-testsuite-ldc-v0.17.1/fail_compilation/fail11426.d
dmd-testsuite-ldc-v0.17.1/fail_compilation/fail11445.d
dmd-testsuite-ldc-v0.17.1/fail_compilation/fail11453a.d
dmd-testsuite-ldc-v0.17.1/fail_compilation/fail11453b.d
dmd-testsuite-ldc-v0.17.1/fail_compilation/fail115.d
dmd-testsuite-ldc-v0.17.1/fail_compilation/fail11503a.d
dmd-testsuite-ldc-v0.17.1/fail_compilation/fail11503b.d
dmd-testsuite-ldc-v0.17.1/fail_compilation/fail11503c.d
dmd-testsuite-ldc-v0.17.1/fail_compilation/fail11503d.d
dmd-testsuite-ldc-v0.17.1/fail_compilation/fail11510.d
dmd-testsuite-ldc-v0.17.1/fail_compilation/fail11532.d
dmd-testsuite-ldc-v0.17.1/fail_compilation/fail11542.d
dmd-testsuite-ldc-v0.17.1/fail_compilation/fail11545.d
dmd-testsuite-ldc-v0.17.1/fail_compilation/fail11552.d
dmd-testsuite-ldc-v0.17.1/fail_compilation/fail11562.d
dmd-testsuite-ldc-v0.17.1/fail_compilation/fail11591b.d
dmd-testsuite-ldc-v0.17.1/fail_compilation/fail116.d
dmd-testsuite-ldc-v0.17.1/fail_compilation/fail11653.d
dmd-testsuite-ldc-v0.17.1/fail_compilation/fail117.d
dmd-testsuite-ldc-v0.17.1/fail_compilation/fail11720.d
dmd-testsuite-ldc-v0.17.1/fail_compilation/fail11746.d
dmd-testsuite-ldc-v0.17.1/fail_compilation/fail11748.d
dmd-testsuite-ldc-v0.17.1/fail_compilation/fail11751.d
dmd-testsuite-ldc-v0.17.1/fail_compilation/fail118.d
dmd-testsuite-ldc-v0.17.1/fail_compilation/fail12.d
dmd-testsuite-ldc-v0.17.1/fail_compilation/fail120.d
dmd-testsuite-ldc-v0.17.1/fail_compilation/fail12047.d
dmd-testsuite-ldc-v0.17.1/fail_compilation/fail121.d
dmd-testsuite-ldc-v0.17.1/fail_compilation/fail122.d
dmd-testsuite-ldc-v0.17.1/fail_compilation/fail12236.d
dmd-testsuite-ldc-v0.17.1/fail_compilation/fail12255.d
dmd-testsuite-ldc-v0.17.1/fail_compilation/fail123.d
dmd-testsuite-ldc-v0.17.1/fail_compilation/fail12378.d
dmd-testsuite-ldc-v0.17.1/fail_compilation/fail12390.d
dmd-testsuite-ldc-v0.17.1/fail_compilation/fail124.d
dmd-testsuite-ldc-v0.17.1/fail_compilation/fail12436.d
dmd-testsuite-ldc-v0.17.1/fail_compilation/fail12485.d
dmd-testsuite-ldc-v0.17.1/fail_compilation/fail125.d
dmd-testsuite-ldc-v0.17.1/fail_compilation/fail12567.d
dmd-testsuite-ldc-v0.17.1/fail_compilation/fail126.d
dmd-testsuite-ldc-v0.17.1/fail_compilation/fail12604.d
dmd-testsuite-ldc-v0.17.1/fail_compilation/fail12622.d
dmd-testsuite-ldc-v0.17.1/fail_compilation/fail12635.d
dmd-testsuite-ldc-v0.17.1/fail_compilation/fail12636.d
dmd-testsuite-ldc-v0.17.1/fail_compilation/fail127.d
dmd-testsuite-ldc-v0.17.1/fail_compilation/fail12749.d
dmd-testsuite-ldc-v0.17.1/fail_compilation/fail12809.d
dmd-testsuite-ldc-v0.17.1/fail_compilation/fail129.d
dmd-testsuite-ldc-v0.17.1/fail_compilation/fail12901.d
dmd-testsuite-ldc-v0.17.1/fail_compilation/fail12908.d
dmd-testsuite-ldc-v0.17.1/fail_compilation/fail12932.d
dmd-testsuite-ldc-v0.17.1/fail_compilation/fail13064.d
dmd-testsuite-ldc-v0.17.1/fail_compilation/fail131.d
dmd-testsuite-ldc-v0.17.1/fail_compilation/fail13116.d
dmd-testsuite-ldc-v0.17.1/fail_compilation/fail13120.d
dmd-testsuite-ldc-v0.17.1/fail_compilation/fail1313a.d
dmd-testsuite-ldc-v0.17.1/fail_compilation/fail1313b.d
dmd-testsuite-ldc-v0.17.1/fail_compilation/fail13187.d
dmd-testsuite-ldc-v0.17.1/fail_compilation/fail132.d
dmd-testsuite-ldc-v0.17.1/fail_compilation/fail133.d
dmd-testsuite-ldc-v0.17.1/fail_compilation/fail13336a.d
dmd-testsuite-ldc-v0.17.1/fail_compilation/fail13336b.d
dmd-testsuite-ldc-v0.17.1/fail_compilation/fail134.d
dmd-testsuite-ldc-v0.17.1/fail_compilation/fail13424.d
dmd-testsuite-ldc-v0.17.1/fail_compilation/fail13434_m32.d
dmd-testsuite-ldc-v0.17.1/fail_compilation/fail13434_m64.d
dmd-testsuite-ldc-v0.17.1/fail_compilation/fail13498.d
dmd-testsuite-ldc-v0.17.1/fail_compilation/fail13574.d
dmd-testsuite-ldc-v0.17.1/fail_compilation/fail136.d
dmd-testsuite-ldc-v0.17.1/fail_compilation/fail13601.d
dmd-testsuite-ldc-v0.17.1/fail_compilation/fail137.d
dmd-testsuite-ldc-v0.17.1/fail_compilation/fail13701.d
dmd-testsuite-ldc-v0.17.1/fail_compilation/fail13756.d
dmd-testsuite-ldc-v0.17.1/fail_compilation/fail13775.d
dmd-testsuite-ldc-v0.17.1/fail_compilation/fail139.d
dmd-testsuite-ldc-v0.17.1/fail_compilation/fail13902.d
dmd-testsuite-ldc-v0.17.1/fail_compilation/fail13938.d
dmd-testsuite-ldc-v0.17.1/fail_compilation/fail13939.d
dmd-testsuite-ldc-v0.17.1/fail_compilation/fail14.d
dmd-testsuite-ldc-v0.17.1/fail_compilation/fail140.d
dmd-testsuite-ldc-v0.17.1/fail_compilation/fail14009.d
dmd-testsuite-ldc-v0.17.1/fail_compilation/fail14089.d
dmd-testsuite-ldc-v0.17.1/fail_compilation/fail141.d
dmd-testsuite-ldc-v0.17.1/fail_compilation/fail142.d
dmd-testsuite-ldc-v0.17.1/fail_compilation/fail14249.d
dmd-testsuite-ldc-v0.17.1/fail_compilation/fail143.d
dmd-testsuite-ldc-v0.17.1/fail_compilation/fail14304.d
dmd-testsuite-ldc-v0.17.1/fail_compilation/fail144.d
dmd-testsuite-ldc-v0.17.1/fail_compilation/fail14406.d
dmd-testsuite-ldc-v0.17.1/fail_compilation/fail14407.d
dmd-testsuite-ldc-v0.17.1/fail_compilation/fail14416.d
dmd-testsuite-ldc-v0.17.1/fail_compilation/fail145.d
dmd-testsuite-ldc-v0.17.1/fail_compilation/fail14554.d
dmd-testsuite-ldc-v0.17.1/fail_compilation/fail15.d
dmd-testsuite-ldc-v0.17.1/fail_compilation/fail150.d
dmd-testsuite-ldc-v0.17.1/fail_compilation/fail15044.d
dmd-testsuite-ldc-v0.17.1/fail_compilation/fail152.d
dmd-testsuite-ldc-v0.17.1/fail_compilation/fail153.d
dmd-testsuite-ldc-v0.17.1/fail_compilation/fail154.d
dmd-testsuite-ldc-v0.17.1/fail_compilation/fail155.d
dmd-testsuite-ldc-v0.17.1/fail_compilation/fail156.d
dmd-testsuite-ldc-v0.17.1/fail_compilation/fail158.d
dmd-testsuite-ldc-v0.17.1/fail_compilation/fail159.d
dmd-testsuite-ldc-v0.17.1/fail_compilation/fail16.d
dmd-testsuite-ldc-v0.17.1/fail_compilation/fail160.d
dmd-testsuite-ldc-v0.17.1/fail_compilation/fail161.d
dmd-testsuite-ldc-v0.17.1/fail_compilation/fail162.d
dmd-testsuite-ldc-v0.17.1/fail_compilation/fail163.d
dmd-testsuite-ldc-v0.17.1/fail_compilation/fail169.d
dmd-testsuite-ldc-v0.17.1/fail_compilation/fail17.d
dmd-testsuite-ldc-v0.17.1/fail_compilation/fail170.d
dmd-testsuite-ldc-v0.17.1/fail_compilation/fail172.d
dmd-testsuite-ldc-v0.17.1/fail_compilation/fail176.d
dmd-testsuite-ldc-v0.17.1/fail_compilation/fail177.d
dmd-testsuite-ldc-v0.17.1/fail_compilation/fail179.d
dmd-testsuite-ldc-v0.17.1/fail_compilation/fail18.d
dmd-testsuite-ldc-v0.17.1/fail_compilation/fail180.d
dmd-testsuite-ldc-v0.17.1/fail_compilation/fail183.d
dmd-testsuite-ldc-v0.17.1/fail_compilation/fail184.d
dmd-testsuite-ldc-v0.17.1/fail_compilation/fail185.d
dmd-testsuite-ldc-v0.17.1/fail_compilation/fail187.d
dmd-testsuite-ldc-v0.17.1/fail_compilation/fail188.d
dmd-testsuite-ldc-v0.17.1/fail_compilation/fail189.d
dmd-testsuite-ldc-v0.17.1/fail_compilation/fail190.d
dmd-testsuite-ldc-v0.17.1/fail_compilation/fail1900.d
dmd-testsuite-ldc-v0.17.1/fail_compilation/fail191.d
dmd-testsuite-ldc-v0.17.1/fail_compilation/fail192.d
dmd-testsuite-ldc-v0.17.1/fail_compilation/fail193.d
dmd-testsuite-ldc-v0.17.1/fail_compilation/fail194.d
dmd-testsuite-ldc-v0.17.1/fail_compilation/fail195.d
dmd-testsuite-ldc-v0.17.1/fail_compilation/fail196.d
dmd-testsuite-ldc-v0.17.1/fail_compilation/fail198.d
dmd-testsuite-ldc-v0.17.1/fail_compilation/fail199.d
dmd-testsuite-ldc-v0.17.1/fail_compilation/fail20.d
dmd-testsuite-ldc-v0.17.1/fail_compilation/fail200.d
dmd-testsuite-ldc-v0.17.1/fail_compilation/fail201.d
dmd-testsuite-ldc-v0.17.1/fail_compilation/fail202.d
dmd-testsuite-ldc-v0.17.1/fail_compilation/fail203.d
dmd-testsuite-ldc-v0.17.1/fail_compilation/fail204.d
dmd-testsuite-ldc-v0.17.1/fail_compilation/fail205.d
dmd-testsuite-ldc-v0.17.1/fail_compilation/fail206.d
dmd-testsuite-ldc-v0.17.1/fail_compilation/fail207.d
dmd-testsuite-ldc-v0.17.1/fail_compilation/fail208.d
dmd-testsuite-ldc-v0.17.1/fail_compilation/fail209.d
dmd-testsuite-ldc-v0.17.1/fail_compilation/fail212.d
dmd-testsuite-ldc-v0.17.1/fail_compilation/fail213.d
dmd-testsuite-ldc-v0.17.1/fail_compilation/fail215.d
dmd-testsuite-ldc-v0.17.1/fail_compilation/fail216.d
dmd-testsuite-ldc-v0.17.1/fail_compilation/fail217.d
dmd-testsuite-ldc-v0.17.1/fail_compilation/fail218.d
dmd-testsuite-ldc-v0.17.1/fail_compilation/fail22.d
dmd-testsuite-ldc-v0.17.1/fail_compilation/fail220.d
dmd-testsuite-ldc-v0.17.1/fail_compilation/fail221.d
dmd-testsuite-ldc-v0.17.1/fail_compilation/fail222.d
dmd-testsuite-ldc-v0.17.1/fail_compilation/fail223.d
dmd-testsuite-ldc-v0.17.1/fail_compilation/fail224.d
dmd-testsuite-ldc-v0.17.1/fail_compilation/fail225.d
dmd-testsuite-ldc-v0.17.1/fail_compilation/fail228.d
dmd-testsuite-ldc-v0.17.1/fail_compilation/fail229.d
dmd-testsuite-ldc-v0.17.1/fail_compilation/fail23.d
dmd-testsuite-ldc-v0.17.1/fail_compilation/fail231.d
dmd-testsuite-ldc-v0.17.1/fail_compilation/fail232.d
dmd-testsuite-ldc-v0.17.1/fail_compilation/fail233.d
dmd-testsuite-ldc-v0.17.1/fail_compilation/fail235.d
dmd-testsuite-ldc-v0.17.1/fail_compilation/fail2350.d
dmd-testsuite-ldc-v0.17.1/fail_compilation/fail236.d
dmd-testsuite-ldc-v0.17.1/fail_compilation/fail2361.d
dmd-testsuite-ldc-v0.17.1/fail_compilation/fail237.d
dmd-testsuite-ldc-v0.17.1/fail_compilation/fail238_m32.d
dmd-testsuite-ldc-v0.17.1/fail_compilation/fail238_m64.d
dmd-testsuite-ldc-v0.17.1/fail_compilation/fail239.d
dmd-testsuite-ldc-v0.17.1/fail_compilation/fail24.d
dmd-testsuite-ldc-v0.17.1/fail_compilation/fail240.d
dmd-testsuite-ldc-v0.17.1/fail_compilation/fail241.d
dmd-testsuite-ldc-v0.17.1/fail_compilation/fail243.d
dmd-testsuite-ldc-v0.17.1/fail_compilation/fail243t.d
dmd-testsuite-ldc-v0.17.1/fail_compilation/fail244.d
dmd-testsuite-ldc-v0.17.1/fail_compilation/fail245.d
dmd-testsuite-ldc-v0.17.1/fail_compilation/fail2456.d
dmd-testsuite-ldc-v0.17.1/fail_compilation/fail246.d
dmd-testsuite-ldc-v0.17.1/fail_compilation/fail247.d
dmd-testsuite-ldc-v0.17.1/fail_compilation/fail248.d
dmd-testsuite-ldc-v0.17.1/fail_compilation/fail2483.d
dmd-testsuite-ldc-v0.17.1/fail_compilation/fail249.d
dmd-testsuite-ldc-v0.17.1/fail_compilation/fail25.d
dmd-testsuite-ldc-v0.17.1/fail_compilation/fail250.d
dmd-testsuite-ldc-v0.17.1/fail_compilation/fail251.d
dmd-testsuite-ldc-v0.17.1/fail_compilation/fail252.d
dmd-testsuite-ldc-v0.17.1/fail_compilation/fail253.d
dmd-testsuite-ldc-v0.17.1/fail_compilation/fail254.d
dmd-testsuite-ldc-v0.17.1/fail_compilation/fail256.d
dmd-testsuite-ldc-v0.17.1/fail_compilation/fail257.d
dmd-testsuite-ldc-v0.17.1/fail_compilation/fail258.d
dmd-testsuite-ldc-v0.17.1/fail_compilation/fail259.d
dmd-testsuite-ldc-v0.17.1/fail_compilation/fail261.d
dmd-testsuite-ldc-v0.17.1/fail_compilation/fail262.d
dmd-testsuite-ldc-v0.17.1/fail_compilation/fail263.d
dmd-testsuite-ldc-v0.17.1/fail_compilation/fail264.d
dmd-testsuite-ldc-v0.17.1/fail_compilation/fail265.d
dmd-testsuite-ldc-v0.17.1/fail_compilation/fail2656.d
dmd-testsuite-ldc-v0.17.1/fail_compilation/fail267.d
dmd-testsuite-ldc-v0.17.1/fail_compilation/fail269.d
dmd-testsuite-ldc-v0.17.1/fail_compilation/fail27.d
dmd-testsuite-ldc-v0.17.1/fail_compilation/fail270.d
dmd-testsuite-ldc-v0.17.1/fail_compilation/fail272.d
dmd-testsuite-ldc-v0.17.1/fail_compilation/fail273.d
dmd-testsuite-ldc-v0.17.1/fail_compilation/fail274.d
dmd-testsuite-ldc-v0.17.1/fail_compilation/fail2740.d
dmd-testsuite-ldc-v0.17.1/fail_compilation/fail275.d
dmd-testsuite-ldc-v0.17.1/fail_compilation/fail276.d
dmd-testsuite-ldc-v0.17.1/fail_compilation/fail278.d
dmd-testsuite-ldc-v0.17.1/fail_compilation/fail279.d
dmd-testsuite-ldc-v0.17.1/fail_compilation/fail280.d
dmd-testsuite-ldc-v0.17.1/fail_compilation/fail281.d
dmd-testsuite-ldc-v0.17.1/fail_compilation/fail282.d
dmd-testsuite-ldc-v0.17.1/fail_compilation/fail284.d
dmd-testsuite-ldc-v0.17.1/fail_compilation/fail285.d
dmd-testsuite-ldc-v0.17.1/fail_compilation/fail286.d
dmd-testsuite-ldc-v0.17.1/fail_compilation/fail287.d
dmd-testsuite-ldc-v0.17.1/fail_compilation/fail288.d
dmd-testsuite-ldc-v0.17.1/fail_compilation/fail289.d
dmd-testsuite-ldc-v0.17.1/fail_compilation/fail290.d
dmd-testsuite-ldc-v0.17.1/fail_compilation/fail291.d
dmd-testsuite-ldc-v0.17.1/fail_compilation/fail296.d
dmd-testsuite-ldc-v0.17.1/fail_compilation/fail2962.d
dmd-testsuite-ldc-v0.17.1/fail_compilation/fail297.d
dmd-testsuite-ldc-v0.17.1/fail_compilation/fail298.d
dmd-testsuite-ldc-v0.17.1/fail_compilation/fail299.d
dmd-testsuite-ldc-v0.17.1/fail_compilation/fail3.d
dmd-testsuite-ldc-v0.17.1/fail_compilation/fail301.d
dmd-testsuite-ldc-v0.17.1/fail_compilation/fail302.d
dmd-testsuite-ldc-v0.17.1/fail_compilation/fail303.d
dmd-testsuite-ldc-v0.17.1/fail_compilation/fail304.d
dmd-testsuite-ldc-v0.17.1/fail_compilation/fail305.d
dmd-testsuite-ldc-v0.17.1/fail_compilation/fail306.d
dmd-testsuite-ldc-v0.17.1/fail_compilation/fail307.d
dmd-testsuite-ldc-v0.17.1/fail_compilation/fail308.d
dmd-testsuite-ldc-v0.17.1/fail_compilation/fail309.d
dmd-testsuite-ldc-v0.17.1/fail_compilation/fail310.d
dmd-testsuite-ldc-v0.17.1/fail_compilation/fail311.d
dmd-testsuite-ldc-v0.17.1/fail_compilation/fail312.d
dmd-testsuite-ldc-v0.17.1/fail_compilation/fail313.d
dmd-testsuite-ldc-v0.17.1/fail_compilation/fail314.d
dmd-testsuite-ldc-v0.17.1/fail_compilation/fail3144.d
dmd-testsuite-ldc-v0.17.1/fail_compilation/fail315.d
dmd-testsuite-ldc-v0.17.1/fail_compilation/fail3150.d
dmd-testsuite-ldc-v0.17.1/fail_compilation/fail316.d
dmd-testsuite-ldc-v0.17.1/fail_compilation/fail317.d
dmd-testsuite-ldc-v0.17.1/fail_compilation/fail318.d
dmd-testsuite-ldc-v0.17.1/fail_compilation/fail319.d
dmd-testsuite-ldc-v0.17.1/fail_compilation/fail320.d
dmd-testsuite-ldc-v0.17.1/fail_compilation/fail322.d
dmd-testsuite-ldc-v0.17.1/fail_compilation/fail324.d
dmd-testsuite-ldc-v0.17.1/fail_compilation/fail325.d
dmd-testsuite-ldc-v0.17.1/fail_compilation/fail327.d
dmd-testsuite-ldc-v0.17.1/fail_compilation/fail328.d
dmd-testsuite-ldc-v0.17.1/fail_compilation/fail329.d
dmd-testsuite-ldc-v0.17.1/fail_compilation/fail3290.d
dmd-testsuite-ldc-v0.17.1/fail_compilation/fail330.d
dmd-testsuite-ldc-v0.17.1/fail_compilation/fail331.d
dmd-testsuite-ldc-v0.17.1/fail_compilation/fail332.d
dmd-testsuite-ldc-v0.17.1/fail_compilation/fail333.d
dmd-testsuite-ldc-v0.17.1/fail_compilation/fail334.d
dmd-testsuite-ldc-v0.17.1/fail_compilation/fail335.d
dmd-testsuite-ldc-v0.17.1/fail_compilation/fail3354.d
dmd-testsuite-ldc-v0.17.1/fail_compilation/fail336.d
dmd-testsuite-ldc-v0.17.1/fail_compilation/fail337.d
dmd-testsuite-ldc-v0.17.1/fail_compilation/fail34.d
dmd-testsuite-ldc-v0.17.1/fail_compilation/fail340.d
dmd-testsuite-ldc-v0.17.1/fail_compilation/fail341.d
dmd-testsuite-ldc-v0.17.1/fail_compilation/fail343.d
dmd-testsuite-ldc-v0.17.1/fail_compilation/fail344.d
dmd-testsuite-ldc-v0.17.1/fail_compilation/fail346.d
dmd-testsuite-ldc-v0.17.1/fail_compilation/fail347.d
dmd-testsuite-ldc-v0.17.1/fail_compilation/fail349.d
dmd-testsuite-ldc-v0.17.1/fail_compilation/fail35.d
dmd-testsuite-ldc-v0.17.1/fail_compilation/fail351.d
dmd-testsuite-ldc-v0.17.1/fail_compilation/fail352.d
dmd-testsuite-ldc-v0.17.1/fail_compilation/fail353.d
dmd-testsuite-ldc-v0.17.1/fail_compilation/fail354.d
dmd-testsuite-ldc-v0.17.1/fail_compilation/fail355.d
dmd-testsuite-ldc-v0.17.1/fail_compilation/fail356a.d
dmd-testsuite-ldc-v0.17.1/fail_compilation/fail356b.d
dmd-testsuite-ldc-v0.17.1/fail_compilation/fail356c.d
dmd-testsuite-ldc-v0.17.1/fail_compilation/fail3581a.d
dmd-testsuite-ldc-v0.17.1/fail_compilation/fail3581b.d
dmd-testsuite-ldc-v0.17.1/fail_compilation/fail359.d
dmd-testsuite-ldc-v0.17.1/fail_compilation/fail36.d
dmd-testsuite-ldc-v0.17.1/fail_compilation/fail3672.d
dmd-testsuite-ldc-v0.17.1/fail_compilation/fail3673a.d
dmd-testsuite-ldc-v0.17.1/fail_compilation/fail3673b.d
dmd-testsuite-ldc-v0.17.1/fail_compilation/fail3703.d
dmd-testsuite-ldc-v0.17.1/fail_compilation/fail3731.d
dmd-testsuite-ldc-v0.17.1/fail_compilation/fail3753.d
dmd-testsuite-ldc-v0.17.1/fail_compilation/fail37_m32.d
dmd-testsuite-ldc-v0.17.1/fail_compilation/fail37_m64.d
dmd-testsuite-ldc-v0.17.1/fail_compilation/fail38.d
dmd-testsuite-ldc-v0.17.1/fail_compilation/fail3882.d
dmd-testsuite-ldc-v0.17.1/fail_compilation/fail3895.d
dmd-testsuite-ldc-v0.17.1/fail_compilation/fail39.d
dmd-testsuite-ldc-v0.17.1/fail_compilation/fail3990.d
dmd-testsuite-ldc-v0.17.1/fail_compilation/fail40.d
dmd-testsuite-ldc-v0.17.1/fail_compilation/fail4082.d
dmd-testsuite-ldc-v0.17.1/fail_compilation/fail41.d
dmd-testsuite-ldc-v0.17.1/fail_compilation/fail42.d
dmd-testsuite-ldc-v0.17.1/fail_compilation/fail4206.d
dmd-testsuite-ldc-v0.17.1/fail_compilation/fail4269a.d
dmd-testsuite-ldc-v0.17.1/fail_compilation/fail4269b.d
dmd-testsuite-ldc-v0.17.1/fail_compilation/fail4269c.d
dmd-testsuite-ldc-v0.17.1/fail_compilation/fail4269d.d
dmd-testsuite-ldc-v0.17.1/fail_compilation/fail4269e.d
dmd-testsuite-ldc-v0.17.1/fail_compilation/fail4269f.d
dmd-testsuite-ldc-v0.17.1/fail_compilation/fail4269g.d
dmd-testsuite-ldc-v0.17.1/fail_compilation/fail4374.d
dmd-testsuite-ldc-v0.17.1/fail_compilation/fail4375a.d
dmd-testsuite-ldc-v0.17.1/fail_compilation/fail4375b.d
dmd-testsuite-ldc-v0.17.1/fail_compilation/fail4375c.d
dmd-testsuite-ldc-v0.17.1/fail_compilation/fail4375d.d
dmd-testsuite-ldc-v0.17.1/fail_compilation/fail4375e.d
dmd-testsuite-ldc-v0.17.1/fail_compilation/fail4375f.d
dmd-testsuite-ldc-v0.17.1/fail_compilation/fail4375g.d
dmd-testsuite-ldc-v0.17.1/fail_compilation/fail4375h.d
dmd-testsuite-ldc-v0.17.1/fail_compilation/fail4375i.d
dmd-testsuite-ldc-v0.17.1/fail_compilation/fail4375j.d
dmd-testsuite-ldc-v0.17.1/fail_compilation/fail4375k.d
dmd-testsuite-ldc-v0.17.1/fail_compilation/fail4375l.d
dmd-testsuite-ldc-v0.17.1/fail_compilation/fail4375m.d
dmd-testsuite-ldc-v0.17.1/fail_compilation/fail4375o.d
dmd-testsuite-ldc-v0.17.1/fail_compilation/fail4375p.d
dmd-testsuite-ldc-v0.17.1/fail_compilation/fail4375q.d
dmd-testsuite-ldc-v0.17.1/fail_compilation/fail4375r.d
dmd-testsuite-ldc-v0.17.1/fail_compilation/fail4375s.d
dmd-testsuite-ldc-v0.17.1/fail_compilation/fail4375t.d
dmd-testsuite-ldc-v0.17.1/fail_compilation/fail4375u.d
dmd-testsuite-ldc-v0.17.1/fail_compilation/fail4375v.d
dmd-testsuite-ldc-v0.17.1/fail_compilation/fail4375w.d
dmd-testsuite-ldc-v0.17.1/fail_compilation/fail4375x.d
dmd-testsuite-ldc-v0.17.1/fail_compilation/fail4375y.d
dmd-testsuite-ldc-v0.17.1/fail_compilation/fail44.d
dmd-testsuite-ldc-v0.17.1/fail_compilation/fail4421.d
dmd-testsuite-ldc-v0.17.1/fail_compilation/fail4448.d
dmd-testsuite-ldc-v0.17.1/fail_compilation/fail45.d
dmd-testsuite-ldc-v0.17.1/fail_compilation/fail4510.d
dmd-testsuite-ldc-v0.17.1/fail_compilation/fail4511.d
dmd-testsuite-ldc-v0.17.1/fail_compilation/fail4517.d
dmd-testsuite-ldc-v0.17.1/fail_compilation/fail46.d
dmd-testsuite-ldc-v0.17.1/fail_compilation/fail4611.d
dmd-testsuite-ldc-v0.17.1/fail_compilation/fail47.d
dmd-testsuite-ldc-v0.17.1/fail_compilation/fail4958.d
dmd-testsuite-ldc-v0.17.1/fail_compilation/fail50.d
dmd-testsuite-ldc-v0.17.1/fail_compilation/fail51.d
dmd-testsuite-ldc-v0.17.1/fail_compilation/fail52.d
dmd-testsuite-ldc-v0.17.1/fail_compilation/fail5299.d
dmd-testsuite-ldc-v0.17.1/fail_compilation/fail53.d
dmd-testsuite-ldc-v0.17.1/fail_compilation/fail54.d
dmd-testsuite-ldc-v0.17.1/fail_compilation/fail5435.d
dmd-testsuite-ldc-v0.17.1/fail_compilation/fail55.d
dmd-testsuite-ldc-v0.17.1/fail_compilation/fail56.d
dmd-testsuite-ldc-v0.17.1/fail_compilation/fail5634.d
dmd-testsuite-ldc-v0.17.1/fail_compilation/fail57.d
dmd-testsuite-ldc-v0.17.1/fail_compilation/fail5733.d
dmd-testsuite-ldc-v0.17.1/fail_compilation/fail58.d
dmd-testsuite-ldc-v0.17.1/fail_compilation/fail5851.d
dmd-testsuite-ldc-v0.17.1/fail_compilation/fail59.d
dmd-testsuite-ldc-v0.17.1/fail_compilation/fail5908.d
dmd-testsuite-ldc-v0.17.1/fail_compilation/fail5953a1.d
dmd-testsuite-ldc-v0.17.1/fail_compilation/fail5953a2.d
dmd-testsuite-ldc-v0.17.1/fail_compilation/fail5953s1.d
dmd-testsuite-ldc-v0.17.1/fail_compilation/fail5953s2.d
dmd-testsuite-ldc-v0.17.1/fail_compilation/fail60.d
dmd-testsuite-ldc-v0.17.1/fail_compilation/fail6029.d
dmd-testsuite-ldc-v0.17.1/fail_compilation/fail61.d
dmd-testsuite-ldc-v0.17.1/fail_compilation/fail6107.d
dmd-testsuite-ldc-v0.17.1/fail_compilation/fail62.d
dmd-testsuite-ldc-v0.17.1/fail_compilation/fail6242.d
dmd-testsuite-ldc-v0.17.1/fail_compilation/fail63.d
dmd-testsuite-ldc-v0.17.1/fail_compilation/fail6334.d
dmd-testsuite-ldc-v0.17.1/fail_compilation/fail6451.d
dmd-testsuite-ldc-v0.17.1/fail_compilation/fail6453.d
dmd-testsuite-ldc-v0.17.1/fail_compilation/fail6458.d
dmd-testsuite-ldc-v0.17.1/fail_compilation/fail6497.d
dmd-testsuite-ldc-v0.17.1/fail_compilation/fail6561.d
dmd-testsuite-ldc-v0.17.1/fail_compilation/fail6572.d
dmd-testsuite-ldc-v0.17.1/fail_compilation/fail66.d
dmd-testsuite-ldc-v0.17.1/fail_compilation/fail6611.d
dmd-testsuite-ldc-v0.17.1/fail_compilation/fail6652.d
dmd-testsuite-ldc-v0.17.1/fail_compilation/fail6781.d
dmd-testsuite-ldc-v0.17.1/fail_compilation/fail6795.d
dmd-testsuite-ldc-v0.17.1/fail_compilation/fail6889.d
dmd-testsuite-ldc-v0.17.1/fail_compilation/fail6968.d
dmd-testsuite-ldc-v0.17.1/fail_compilation/fail7077.d
dmd-testsuite-ldc-v0.17.1/fail_compilation/fail7173.d
dmd-testsuite-ldc-v0.17.1/fail_compilation/fail7178.d
dmd-testsuite-ldc-v0.17.1/fail_compilation/fail72.d
dmd-testsuite-ldc-v0.17.1/fail_compilation/fail7234.d
dmd-testsuite-ldc-v0.17.1/fail_compilation/fail7294.d
dmd-testsuite-ldc-v0.17.1/fail_compilation/fail73.d
dmd-testsuite-ldc-v0.17.1/fail_compilation/fail7369.d
dmd-testsuite-ldc-v0.17.1/fail_compilation/fail74.d
dmd-testsuite-ldc-v0.17.1/fail_compilation/fail7424b.d
dmd-testsuite-ldc-v0.17.1/fail_compilation/fail7424c.d
dmd-testsuite-ldc-v0.17.1/fail_compilation/fail7424d.d
dmd-testsuite-ldc-v0.17.1/fail_compilation/fail7424e.d
dmd-testsuite-ldc-v0.17.1/fail_compilation/fail7424f.d
dmd-testsuite-ldc-v0.17.1/fail_compilation/fail7424g.d
dmd-testsuite-ldc-v0.17.1/fail_compilation/fail7424h.d
dmd-testsuite-ldc-v0.17.1/fail_compilation/fail7424i.d
dmd-testsuite-ldc-v0.17.1/fail_compilation/fail75.d
dmd-testsuite-ldc-v0.17.1/fail_compilation/fail7524a.d
dmd-testsuite-ldc-v0.17.1/fail_compilation/fail7524b.d
dmd-testsuite-ldc-v0.17.1/fail_compilation/fail76.d
dmd-testsuite-ldc-v0.17.1/fail_compilation/fail7603a.d
dmd-testsuite-ldc-v0.17.1/fail_compilation/fail7603b.d
dmd-testsuite-ldc-v0.17.1/fail_compilation/fail7603c.d
dmd-testsuite-ldc-v0.17.1/fail_compilation/fail77.d
dmd-testsuite-ldc-v0.17.1/fail_compilation/fail7702.d
dmd-testsuite-ldc-v0.17.1/fail_compilation/fail7751.d
dmd-testsuite-ldc-v0.17.1/fail_compilation/fail78.d
dmd-testsuite-ldc-v0.17.1/fail_compilation/fail7815.d
dmd-testsuite-ldc-v0.17.1/fail_compilation/fail7848.d
dmd-testsuite-ldc-v0.17.1/fail_compilation/fail7851.d
dmd-testsuite-ldc-v0.17.1/fail_compilation/fail7859.d
dmd-testsuite-ldc-v0.17.1/fail_compilation/fail7861.d
dmd-testsuite-ldc-v0.17.1/fail_compilation/fail7862.d
dmd-testsuite-ldc-v0.17.1/fail_compilation/fail7886.d
dmd-testsuite-ldc-v0.17.1/fail_compilation/fail79.d
dmd-testsuite-ldc-v0.17.1/fail_compilation/fail8009.d
dmd-testsuite-ldc-v0.17.1/fail_compilation/fail8032.d
dmd-testsuite-ldc-v0.17.1/fail_compilation/fail80_m32.d
dmd-testsuite-ldc-v0.17.1/fail_compilation/fail80_m64.d
dmd-testsuite-ldc-v0.17.1/fail_compilation/fail8168.d
dmd-testsuite-ldc-v0.17.1/fail_compilation/fail8179b.d
dmd-testsuite-ldc-v0.17.1/fail_compilation/fail8217.d
dmd-testsuite-ldc-v0.17.1/fail_compilation/fail8313.d
dmd-testsuite-ldc-v0.17.1/fail_compilation/fail8373.d
dmd-testsuite-ldc-v0.17.1/fail_compilation/fail86.d
dmd-testsuite-ldc-v0.17.1/fail_compilation/fail8631.d
dmd-testsuite-ldc-v0.17.1/fail_compilation/fail8664.d
dmd-testsuite-ldc-v0.17.1/fail_compilation/fail8691.d
dmd-testsuite-ldc-v0.17.1/fail_compilation/fail87.d
dmd-testsuite-ldc-v0.17.1/fail_compilation/fail8724.d
dmd-testsuite-ldc-v0.17.1/fail_compilation/fail88.d
dmd-testsuite-ldc-v0.17.1/fail_compilation/fail89.d
dmd-testsuite-ldc-v0.17.1/fail_compilation/fail9.d
dmd-testsuite-ldc-v0.17.1/fail_compilation/fail90.d
dmd-testsuite-ldc-v0.17.1/fail_compilation/fail9063.d
dmd-testsuite-ldc-v0.17.1/fail_compilation/fail9081.d
dmd-testsuite-ldc-v0.17.1/fail_compilation/fail91.d
dmd-testsuite-ldc-v0.17.1/fail_compilation/fail9199.d
dmd-testsuite-ldc-v0.17.1/fail_compilation/fail92.d
dmd-testsuite-ldc-v0.17.1/fail_compilation/fail9279.d
dmd-testsuite-ldc-v0.17.1/fail_compilation/fail93.d
dmd-testsuite-ldc-v0.17.1/fail_compilation/fail9301.d
dmd-testsuite-ldc-v0.17.1/fail_compilation/fail9346.d
dmd-testsuite-ldc-v0.17.1/fail_compilation/fail9368.d
dmd-testsuite-ldc-v0.17.1/fail_compilation/fail94.d
dmd-testsuite-ldc-v0.17.1/fail_compilation/fail9413.d
dmd-testsuite-ldc-v0.17.1/fail_compilation/fail9414a.d
dmd-testsuite-ldc-v0.17.1/fail_compilation/fail9414b.d
dmd-testsuite-ldc-v0.17.1/fail_compilation/fail9414c.d
dmd-testsuite-ldc-v0.17.1/fail_compilation/fail9414d.d
dmd-testsuite-ldc-v0.17.1/fail_compilation/fail95.d
dmd-testsuite-ldc-v0.17.1/fail_compilation/fail9537.d
dmd-testsuite-ldc-v0.17.1/fail_compilation/fail9562.d
dmd-testsuite-ldc-v0.17.1/fail_compilation/fail9572.d
dmd-testsuite-ldc-v0.17.1/fail_compilation/fail96.d
dmd-testsuite-ldc-v0.17.1/fail_compilation/fail9613.d
dmd-testsuite-ldc-v0.17.1/fail_compilation/fail9665a.d
dmd-testsuite-ldc-v0.17.1/fail_compilation/fail9665b.d
dmd-testsuite-ldc-v0.17.1/fail_compilation/fail97.d
dmd-testsuite-ldc-v0.17.1/fail_compilation/fail9710.d
dmd-testsuite-ldc-v0.17.1/fail_compilation/fail9735.d
dmd-testsuite-ldc-v0.17.1/fail_compilation/fail9773.d
dmd-testsuite-ldc-v0.17.1/fail_compilation/fail9790.d
dmd-testsuite-ldc-v0.17.1/fail_compilation/fail98.d
dmd-testsuite-ldc-v0.17.1/fail_compilation/fail9892.d
dmd-testsuite-ldc-v0.17.1/fail_compilation/fail99.d
dmd-testsuite-ldc-v0.17.1/fail_compilation/fail9936.d
dmd-testsuite-ldc-v0.17.1/fail_compilation/fail_arrayop1.d
dmd-testsuite-ldc-v0.17.1/fail_compilation/fail_arrayop2.d
dmd-testsuite-ldc-v0.17.1/fail_compilation/fail_casting.d
dmd-testsuite-ldc-v0.17.1/fail_compilation/fail_casting1.d
dmd-testsuite-ldc-v0.17.1/fail_compilation/fail_opover.d
dmd-testsuite-ldc-v0.17.1/fail_compilation/fail_scope.d
dmd-testsuite-ldc-v0.17.1/fail_compilation/faildeleteaa.d
dmd-testsuite-ldc-v0.17.1/fail_compilation/faildottypeinfo.d
dmd-testsuite-ldc-v0.17.1/fail_compilation/failescape.d
dmd-testsuite-ldc-v0.17.1/fail_compilation/failinout1.d
dmd-testsuite-ldc-v0.17.1/fail_compilation/failinout2.d
dmd-testsuite-ldc-v0.17.1/fail_compilation/failinout3748a.d
dmd-testsuite-ldc-v0.17.1/fail_compilation/failinout3748b.d
dmd-testsuite-ldc-v0.17.1/fail_compilation/failmemalloc.d
dmd-testsuite-ldc-v0.17.1/fail_compilation/failoffset.d
dmd-testsuite-ldc-v0.17.1/fail_compilation/failsafea.d
dmd-testsuite-ldc-v0.17.1/fail_compilation/failsafeb.d
dmd-testsuite-ldc-v0.17.1/fail_compilation/failsafec.d
dmd-testsuite-ldc-v0.17.1/fail_compilation/fix350a.d
dmd-testsuite-ldc-v0.17.1/fail_compilation/fix350b.d
dmd-testsuite-ldc-v0.17.1/fail_compilation/gag4269a.d
dmd-testsuite-ldc-v0.17.1/fail_compilation/gag4269b.d
dmd-testsuite-ldc-v0.17.1/fail_compilation/gag4269c.d
dmd-testsuite-ldc-v0.17.1/fail_compilation/gag4269d.d
dmd-testsuite-ldc-v0.17.1/fail_compilation/gag4269e.d
dmd-testsuite-ldc-v0.17.1/fail_compilation/gag4269f.d
dmd-testsuite-ldc-v0.17.1/fail_compilation/gag4269g.d
dmd-testsuite-ldc-v0.17.1/fail_compilation/ice10016.d
dmd-testsuite-ldc-v0.17.1/fail_compilation/ice10076.d
dmd-testsuite-ldc-v0.17.1/fail_compilation/ice10212.d
dmd-testsuite-ldc-v0.17.1/fail_compilation/ice10259.d
dmd-testsuite-ldc-v0.17.1/fail_compilation/ice10273.d
dmd-testsuite-ldc-v0.17.1/fail_compilation/ice10283.d
dmd-testsuite-ldc-v0.17.1/fail_compilation/ice10341.d
dmd-testsuite-ldc-v0.17.1/fail_compilation/ice10382.d
dmd-testsuite-ldc-v0.17.1/fail_compilation/ice10419.d
dmd-testsuite-ldc-v0.17.1/fail_compilation/ice10599.d
dmd-testsuite-ldc-v0.17.1/fail_compilation/ice10600.d
dmd-testsuite-ldc-v0.17.1/fail_compilation/ice10616.d
dmd-testsuite-ldc-v0.17.1/fail_compilation/ice10624.d
dmd-testsuite-ldc-v0.17.1/fail_compilation/ice10651.d
dmd-testsuite-ldc-v0.17.1/fail_compilation/ice10713.d
dmd-testsuite-ldc-v0.17.1/fail_compilation/ice10727a.d
dmd-testsuite-ldc-v0.17.1/fail_compilation/ice10727b.d
dmd-testsuite-ldc-v0.17.1/fail_compilation/ice10770.d
dmd-testsuite-ldc-v0.17.1/fail_compilation/ice10922.d
dmd-testsuite-ldc-v0.17.1/fail_compilation/ice10938.d
dmd-testsuite-ldc-v0.17.1/fail_compilation/ice10949.d
dmd-testsuite-ldc-v0.17.1/fail_compilation/ice11086.d
dmd-testsuite-ldc-v0.17.1/fail_compilation/ice11136.d
dmd-testsuite-ldc-v0.17.1/fail_compilation/ice11153.d
dmd-testsuite-ldc-v0.17.1/fail_compilation/ice11300.d
dmd-testsuite-ldc-v0.17.1/fail_compilation/ice11404.d
dmd-testsuite-ldc-v0.17.1/fail_compilation/ice1144.d
dmd-testsuite-ldc-v0.17.1/fail_compilation/ice11472.d
dmd-testsuite-ldc-v0.17.1/fail_compilation/ice11513a.d
dmd-testsuite-ldc-v0.17.1/fail_compilation/ice11513b.d
dmd-testsuite-ldc-v0.17.1/fail_compilation/ice11518.d
dmd-testsuite-ldc-v0.17.1/fail_compilation/ice11552.d
dmd-testsuite-ldc-v0.17.1/fail_compilation/ice11553.d
dmd-testsuite-ldc-v0.17.1/fail_compilation/ice11626.d
dmd-testsuite-ldc-v0.17.1/fail_compilation/ice11726.d
dmd-testsuite-ldc-v0.17.1/fail_compilation/ice11755.d
dmd-testsuite-ldc-v0.17.1/fail_compilation/ice11790.d
dmd-testsuite-ldc-v0.17.1/fail_compilation/ice11793.d
dmd-testsuite-ldc-v0.17.1/fail_compilation/ice11822.d
dmd-testsuite-ldc-v0.17.1/fail_compilation/ice11849a.d
dmd-testsuite-ldc-v0.17.1/fail_compilation/ice11849b.d
dmd-testsuite-ldc-v0.17.1/fail_compilation/ice11850.d
dmd-testsuite-ldc-v0.17.1/fail_compilation/ice11919.d
dmd-testsuite-ldc-v0.17.1/fail_compilation/ice11922.d
dmd-testsuite-ldc-v0.17.1/fail_compilation/ice11926.d
dmd-testsuite-ldc-v0.17.1/fail_compilation/ice11944.d
dmd-testsuite-ldc-v0.17.1/fail_compilation/ice11963.d
dmd-testsuite-ldc-v0.17.1/fail_compilation/ice11965.d
dmd-testsuite-ldc-v0.17.1/fail_compilation/ice11967.d
dmd-testsuite-ldc-v0.17.1/fail_compilation/ice11968.d
dmd-testsuite-ldc-v0.17.1/fail_compilation/ice11969.d
dmd-testsuite-ldc-v0.17.1/fail_compilation/ice11974.d
dmd-testsuite-ldc-v0.17.1/fail_compilation/ice11982.d
dmd-testsuite-ldc-v0.17.1/fail_compilation/ice12040.d
dmd-testsuite-ldc-v0.17.1/fail_compilation/ice12158.d
dmd-testsuite-ldc-v0.17.1/fail_compilation/ice12174.d
dmd-testsuite-ldc-v0.17.1/fail_compilation/ice12235.d
dmd-testsuite-ldc-v0.17.1/fail_compilation/ice12350.d
dmd-testsuite-ldc-v0.17.1/fail_compilation/ice12362.d
dmd-testsuite-ldc-v0.17.1/fail_compilation/ice12397.d
dmd-testsuite-ldc-v0.17.1/fail_compilation/ice12497.d
dmd-testsuite-ldc-v0.17.1/fail_compilation/ice12501.d
dmd-testsuite-ldc-v0.17.1/fail_compilation/ice12534.d
dmd-testsuite-ldc-v0.17.1/fail_compilation/ice12539.d
dmd-testsuite-ldc-v0.17.1/fail_compilation/ice12574.d
dmd-testsuite-ldc-v0.17.1/fail_compilation/ice12581.d
dmd-testsuite-ldc-v0.17.1/fail_compilation/ice12673.d
dmd-testsuite-ldc-v0.17.1/fail_compilation/ice12727.d
dmd-testsuite-ldc-v0.17.1/fail_compilation/ice12827.d
dmd-testsuite-ldc-v0.17.1/fail_compilation/ice12836.d
dmd-testsuite-ldc-v0.17.1/fail_compilation/ice12838.d
dmd-testsuite-ldc-v0.17.1/fail_compilation/ice12841.d
dmd-testsuite-ldc-v0.17.1/fail_compilation/ice12850.d
dmd-testsuite-ldc-v0.17.1/fail_compilation/ice12902.d
dmd-testsuite-ldc-v0.17.1/fail_compilation/ice12907.d
dmd-testsuite-ldc-v0.17.1/fail_compilation/ice13024.d
dmd-testsuite-ldc-v0.17.1/fail_compilation/ice13027.d
dmd-testsuite-ldc-v0.17.1/fail_compilation/ice13081.d
dmd-testsuite-ldc-v0.17.1/fail_compilation/ice13131.d
dmd-testsuite-ldc-v0.17.1/fail_compilation/ice13220.d
dmd-testsuite-ldc-v0.17.1/fail_compilation/ice13221.d
dmd-testsuite-ldc-v0.17.1/fail_compilation/ice13225.d
dmd-testsuite-ldc-v0.17.1/fail_compilation/ice13259.d
dmd-testsuite-ldc-v0.17.1/fail_compilation/ice13311.d
dmd-testsuite-ldc-v0.17.1/fail_compilation/ice13356.d
dmd-testsuite-ldc-v0.17.1/fail_compilation/ice13382.d
dmd-testsuite-ldc-v0.17.1/fail_compilation/ice13385.d
dmd-testsuite-ldc-v0.17.1/fail_compilation/ice13459.d
dmd-testsuite-ldc-v0.17.1/fail_compilation/ice13465a.d
dmd-testsuite-ldc-v0.17.1/fail_compilation/ice13465b.d
dmd-testsuite-ldc-v0.17.1/fail_compilation/ice13563.d
dmd-testsuite-ldc-v0.17.1/fail_compilation/ice1358.d
dmd-testsuite-ldc-v0.17.1/fail_compilation/ice13644.d
dmd-testsuite-ldc-v0.17.1/fail_compilation/ice13788.d
dmd-testsuite-ldc-v0.17.1/fail_compilation/ice13816.d
dmd-testsuite-ldc-v0.17.1/fail_compilation/ice13835.d
dmd-testsuite-ldc-v0.17.1/fail_compilation/ice13921.d
dmd-testsuite-ldc-v0.17.1/fail_compilation/ice13987.d
dmd-testsuite-ldc-v0.17.1/fail_compilation/ice14055.d
dmd-testsuite-ldc-v0.17.1/fail_compilation/ice14096.d
dmd-testsuite-ldc-v0.17.1/fail_compilation/ice14116.d
dmd-testsuite-ldc-v0.17.1/fail_compilation/ice14130.d
dmd-testsuite-ldc-v0.17.1/fail_compilation/ice14146.d
dmd-testsuite-ldc-v0.17.1/fail_compilation/ice14177.d
dmd-testsuite-ldc-v0.17.1/fail_compilation/ice14185.d
dmd-testsuite-ldc-v0.17.1/fail_compilation/ice14272.d
dmd-testsuite-ldc-v0.17.1/fail_compilation/ice14424.d
dmd-testsuite-ldc-v0.17.1/fail_compilation/ice14446.d
dmd-testsuite-ldc-v0.17.1/fail_compilation/ice14621.d
dmd-testsuite-ldc-v0.17.1/fail_compilation/ice14642.d
dmd-testsuite-ldc-v0.17.1/fail_compilation/ice14844.d
dmd-testsuite-ldc-v0.17.1/fail_compilation/ice14923.d
dmd-testsuite-ldc-v0.17.1/fail_compilation/ice14929.d
dmd-testsuite-ldc-v0.17.1/fail_compilation/ice15002.d
dmd-testsuite-ldc-v0.17.1/fail_compilation/ice2843.d
dmd-testsuite-ldc-v0.17.1/fail_compilation/ice4094.d
dmd-testsuite-ldc-v0.17.1/fail_compilation/ice4983.d
dmd-testsuite-ldc-v0.17.1/fail_compilation/ice5996.d
dmd-testsuite-ldc-v0.17.1/fail_compilation/ice6538.d
dmd-testsuite-ldc-v0.17.1/fail_compilation/ice7645.d
dmd-testsuite-ldc-v0.17.1/fail_compilation/ice7782.d
dmd-testsuite-ldc-v0.17.1/fail_compilation/ice8100.d
dmd-testsuite-ldc-v0.17.1/fail_compilation/ice8255.d
dmd-testsuite-ldc-v0.17.1/fail_compilation/ice8309.d
dmd-testsuite-ldc-v0.17.1/fail_compilation/ice8499.d
dmd-testsuite-ldc-v0.17.1/fail_compilation/ice8511.d
dmd-testsuite-ldc-v0.17.1/fail_compilation/ice8604.d
dmd-testsuite-ldc-v0.17.1/fail_compilation/ice8630.d
dmd-testsuite-ldc-v0.17.1/fail_compilation/ice8711.d
dmd-testsuite-ldc-v0.17.1/fail_compilation/ice8742.d
dmd-testsuite-ldc-v0.17.1/fail_compilation/ice8795.d
dmd-testsuite-ldc-v0.17.1/fail_compilation/ice8795b.d
dmd-testsuite-ldc-v0.17.1/fail_compilation/ice9013.d
dmd-testsuite-ldc-v0.17.1/fail_compilation/ice9254a.d
dmd-testsuite-ldc-v0.17.1/fail_compilation/ice9254b.d
dmd-testsuite-ldc-v0.17.1/fail_compilation/ice9254c.d
dmd-testsuite-ldc-v0.17.1/fail_compilation/ice9273a.d
dmd-testsuite-ldc-v0.17.1/fail_compilation/ice9273b.d
dmd-testsuite-ldc-v0.17.1/fail_compilation/ice9284.d
dmd-testsuite-ldc-v0.17.1/fail_compilation/ice9291.d
dmd-testsuite-ldc-v0.17.1/fail_compilation/ice9338.d
dmd-testsuite-ldc-v0.17.1/fail_compilation/ice9406.d
dmd-testsuite-ldc-v0.17.1/fail_compilation/ice9439.d
dmd-testsuite-ldc-v0.17.1/fail_compilation/ice9494.d
dmd-testsuite-ldc-v0.17.1/fail_compilation/ice9540.d
dmd-testsuite-ldc-v0.17.1/fail_compilation/ice9545.d
dmd-testsuite-ldc-v0.17.1/fail_compilation/ice9759.d
dmd-testsuite-ldc-v0.17.1/fail_compilation/ice9806.d
dmd-testsuite-ldc-v0.17.1/fail_compilation/ice9865.d
dmd-testsuite-ldc-v0.17.1/fail_compilation/imports/
dmd-testsuite-ldc-v0.17.1/fail_compilation/imports/a10169.d
dmd-testsuite-ldc-v0.17.1/fail_compilation/imports/a10528.d
dmd-testsuite-ldc-v0.17.1/fail_compilation/imports/a11850.d
dmd-testsuite-ldc-v0.17.1/fail_compilation/imports/a11919.d
dmd-testsuite-ldc-v0.17.1/fail_compilation/imports/a13131checkpoint.d
dmd-testsuite-ldc-v0.17.1/fail_compilation/imports/a13131elec.d
dmd-testsuite-ldc-v0.17.1/fail_compilation/imports/a13131parameters.d
dmd-testsuite-ldc-v0.17.1/fail_compilation/imports/a13311.d
dmd-testsuite-ldc-v0.17.1/fail_compilation/imports/a13465.d
dmd-testsuite-ldc-v0.17.1/fail_compilation/imports/a14116.d
dmd-testsuite-ldc-v0.17.1/fail_compilation/imports/a14235.d
dmd-testsuite-ldc-v0.17.1/fail_compilation/imports/a14407.d
dmd-testsuite-ldc-v0.17.1/fail_compilation/imports/a14424.d
dmd-testsuite-ldc-v0.17.1/fail_compilation/imports/b13465.d
dmd-testsuite-ldc-v0.17.1/fail_compilation/imports/bar11136.d
dmd-testsuite-ldc-v0.17.1/fail_compilation/imports/diag10089a.d
dmd-testsuite-ldc-v0.17.1/fail_compilation/imports/diag10089b.d
dmd-testsuite-ldc-v0.17.1/fail_compilation/imports/diag10141a.d
dmd-testsuite-ldc-v0.17.1/fail_compilation/imports/diag10141b.d
dmd-testsuite-ldc-v0.17.1/fail_compilation/imports/diag12598a.d
dmd-testsuite-ldc-v0.17.1/fail_compilation/imports/diag9210b.d
dmd-testsuite-ldc-v0.17.1/fail_compilation/imports/diag9210c.d
dmd-testsuite-ldc-v0.17.1/fail_compilation/imports/diag9210stdcomplex.d
dmd-testsuite-ldc-v0.17.1/fail_compilation/imports/diag9210stdtraits.d
dmd-testsuite-ldc-v0.17.1/fail_compilation/imports/fail10277.d
dmd-testsuite-ldc-v0.17.1/fail_compilation/imports/fail1900a.d
dmd-testsuite-ldc-v0.17.1/fail_compilation/imports/fail1900b.d
dmd-testsuite-ldc-v0.17.1/fail_compilation/imports/fail2962a.d
dmd-testsuite-ldc-v0.17.1/fail_compilation/imports/fail320a.d
dmd-testsuite-ldc-v0.17.1/fail_compilation/imports/fail320b.d
dmd-testsuite-ldc-v0.17.1/fail_compilation/imports/fail347a.d
dmd-testsuite-ldc-v0.17.1/fail_compilation/imports/fail355.d
dmd-testsuite-ldc-v0.17.1/fail_compilation/imports/fail356.d
dmd-testsuite-ldc-v0.17.1/fail_compilation/imports/fail4479.d
dmd-testsuite-ldc-v0.17.1/fail_compilation/imports/fail5385.d
dmd-testsuite-ldc-v0.17.1/fail_compilation/imports/foo10727a.d
dmd-testsuite-ldc-v0.17.1/fail_compilation/imports/foo10727b.d
dmd-testsuite-ldc-v0.17.1/fail_compilation/imports/ice10600a.d
dmd-testsuite-ldc-v0.17.1/fail_compilation/imports/ice10600b.d
dmd-testsuite-ldc-v0.17.1/fail_compilation/imports/ice11300a.d
dmd-testsuite-ldc-v0.17.1/fail_compilation/imports/ice11513x.d
dmd-testsuite-ldc-v0.17.1/fail_compilation/imports/ice11513y.d
dmd-testsuite-ldc-v0.17.1/fail_compilation/imports/ice7782algorithm.d
dmd-testsuite-ldc-v0.17.1/fail_compilation/imports/ice7782range.d
dmd-testsuite-ldc-v0.17.1/fail_compilation/imports/ice9865b.d
dmd-testsuite-ldc-v0.17.1/fail_compilation/imports/spell9644a.d
dmd-testsuite-ldc-v0.17.1/fail_compilation/imports/spell9644b.d
dmd-testsuite-ldc-v0.17.1/fail_compilation/imports/stdtraits10727.d
dmd-testsuite-ldc-v0.17.1/fail_compilation/imports/test10327/
dmd-testsuite-ldc-v0.17.1/fail_compilation/imports/test10327/empty.d
dmd-testsuite-ldc-v0.17.1/fail_compilation/imports/test13152a.d
dmd-testsuite-ldc-v0.17.1/fail_compilation/imports/test13152b.d
dmd-testsuite-ldc-v0.17.1/fail_compilation/imports/test13152c.d
dmd-testsuite-ldc-v0.17.1/fail_compilation/imports/test13152d.d
dmd-testsuite-ldc-v0.17.1/fail_compilation/imports/test13152e.d
dmd-testsuite-ldc-v0.17.1/fail_compilation/imports/test13152f.d
dmd-testsuite-ldc-v0.17.1/fail_compilation/imports/test13152g.d
dmd-testsuite-ldc-v0.17.1/fail_compilation/imports/test13152h.d
dmd-testsuite-ldc-v0.17.1/fail_compilation/imports/test13152i.d
dmd-testsuite-ldc-v0.17.1/fail_compilation/imports/test13152j.d
dmd-testsuite-ldc-v0.17.1/fail_compilation/imports/test13152k.d
dmd-testsuite-ldc-v0.17.1/fail_compilation/imports/test13152l.d
dmd-testsuite-ldc-v0.17.1/fail_compilation/imports/test13152m.d
dmd-testsuite-ldc-v0.17.1/fail_compilation/imports/test13152n.d
dmd-testsuite-ldc-v0.17.1/fail_compilation/imports/test13152o.d
dmd-testsuite-ldc-v0.17.1/fail_compilation/imports/test13152p.d
dmd-testsuite-ldc-v0.17.1/fail_compilation/imports/test13152q.d
dmd-testsuite-ldc-v0.17.1/fail_compilation/imports/test13152r.d
dmd-testsuite-ldc-v0.17.1/fail_compilation/imports/test13152s.d
dmd-testsuite-ldc-v0.17.1/fail_compilation/imports/test13152t.d
dmd-testsuite-ldc-v0.17.1/fail_compilation/imports/test13152u.d
dmd-testsuite-ldc-v0.17.1/fail_compilation/imports/test13152v.d
dmd-testsuite-ldc-v0.17.1/fail_compilation/imports/test13152w.d
dmd-testsuite-ldc-v0.17.1/fail_compilation/imports/test13152x.d
dmd-testsuite-ldc-v0.17.1/fail_compilation/imports/test13152y.d
dmd-testsuite-ldc-v0.17.1/fail_compilation/imports/test13152z.d
dmd-testsuite-ldc-v0.17.1/fail_compilation/imports/test5412a.d
dmd-testsuite-ldc-v0.17.1/fail_compilation/imports/test5412b.d
dmd-testsuite-ldc-v0.17.1/fail_compilation/imports/test64a.d
dmd-testsuite-ldc-v0.17.1/fail_compilation/ldc_diag8425.d
dmd-testsuite-ldc-v0.17.1/fail_compilation/ldc_llvm_inline_ir_1.d
dmd-testsuite-ldc-v0.17.1/fail_compilation/ldc_llvm_inline_ir_2.d
dmd-testsuite-ldc-v0.17.1/fail_compilation/ldc_llvm_inline_ir_3.d
dmd-testsuite-ldc-v0.17.1/fail_compilation/lexer1.d
dmd-testsuite-ldc-v0.17.1/fail_compilation/lexer2.d
dmd-testsuite-ldc-v0.17.1/fail_compilation/lexer3.d
dmd-testsuite-ldc-v0.17.1/fail_compilation/lexer4.d
dmd-testsuite-ldc-v0.17.1/fail_compilation/lexer5.d
dmd-testsuite-ldc-v0.17.1/fail_compilation/mangle1.d
dmd-testsuite-ldc-v0.17.1/fail_compilation/mangle2.d
dmd-testsuite-ldc-v0.17.1/fail_compilation/moduleundefuda.d
dmd-testsuite-ldc-v0.17.1/fail_compilation/nogc1.d
dmd-testsuite-ldc-v0.17.1/fail_compilation/nogc2.d
dmd-testsuite-ldc-v0.17.1/fail_compilation/nogc3.d
dmd-testsuite-ldc-v0.17.1/fail_compilation/parse12924.d
dmd-testsuite-ldc-v0.17.1/fail_compilation/parse12967a.d
dmd-testsuite-ldc-v0.17.1/fail_compilation/parse12967b.d
dmd-testsuite-ldc-v0.17.1/fail_compilation/parse13361.d
dmd-testsuite-ldc-v0.17.1/fail_compilation/parse14285.d
dmd-testsuite-ldc-v0.17.1/fail_compilation/parseStc.d
dmd-testsuite-ldc-v0.17.1/fail_compilation/parseStc2.d
dmd-testsuite-ldc-v0.17.1/fail_compilation/parseStc3.d
dmd-testsuite-ldc-v0.17.1/fail_compilation/parseStc4.d
dmd-testsuite-ldc-v0.17.1/fail_compilation/parseStc5.d
dmd-testsuite-ldc-v0.17.1/fail_compilation/pragmainline.d
dmd-testsuite-ldc-v0.17.1/fail_compilation/pragmainline2.d
dmd-testsuite-ldc-v0.17.1/fail_compilation/protattr1.d
dmd-testsuite-ldc-v0.17.1/fail_compilation/protattr2.d
dmd-testsuite-ldc-v0.17.1/fail_compilation/protattr3.d
dmd-testsuite-ldc-v0.17.1/fail_compilation/protection/
dmd-testsuite-ldc-v0.17.1/fail_compilation/protection/subpkg/
dmd-testsuite-ldc-v0.17.1/fail_compilation/protection/subpkg/test1.d
dmd-testsuite-ldc-v0.17.1/fail_compilation/protection/subpkg/test2.d
dmd-testsuite-ldc-v0.17.1/fail_compilation/protection/subpkg/test3.d
dmd-testsuite-ldc-v0.17.1/fail_compilation/retref.d
dmd-testsuite-ldc-v0.17.1/fail_compilation/retref2.d
dmd-testsuite-ldc-v0.17.1/fail_compilation/spell9644.d
dmd-testsuite-ldc-v0.17.1/fail_compilation/test1.d
dmd-testsuite-ldc-v0.17.1/fail_compilation/test12979.d
dmd-testsuite-ldc-v0.17.1/fail_compilation/test13152.d
dmd-testsuite-ldc-v0.17.1/fail_compilation/test13786.d
dmd-testsuite-ldc-v0.17.1/fail_compilation/test14538.d
dmd-testsuite-ldc-v0.17.1/fail_compilation/test4838.d
dmd-testsuite-ldc-v0.17.1/fail_compilation/test5412a.d
dmd-testsuite-ldc-v0.17.1/fail_compilation/test5412b.d
dmd-testsuite-ldc-v0.17.1/fail_compilation/test5412c.d
dmd-testsuite-ldc-v0.17.1/fail_compilation/test5412c2.di
dmd-testsuite-ldc-v0.17.1/fail_compilation/test64.d
dmd-testsuite-ldc-v0.17.1/fail_compilation/test6883.d
dmd-testsuite-ldc-v0.17.1/fail_compilation/test8509.d
dmd-testsuite-ldc-v0.17.1/fail_compilation/test8556.d
dmd-testsuite-ldc-v0.17.1/fail_compilation/test8751.d
dmd-testsuite-ldc-v0.17.1/fail_compilation/test9150.d
dmd-testsuite-ldc-v0.17.1/fail_compilation/test9176.d
dmd-testsuite-ldc-v0.17.1/fail_compilation/testCols.d
dmd-testsuite-ldc-v0.17.1/fail_compilation/testInference.d
dmd-testsuite-ldc-v0.17.1/fail_compilation/testhtml.html
dmd-testsuite-ldc-v0.17.1/fail_compilation/testhtml2.html
dmd-testsuite-ldc-v0.17.1/fail_compilation/testhtml3.html
dmd-testsuite-ldc-v0.17.1/fail_compilation/testpull1810.d
dmd-testsuite-ldc-v0.17.1/fail_compilation/verrors0.d
dmd-testsuite-ldc-v0.17.1/fail_compilation/verrors5.d
dmd-testsuite-ldc-v0.17.1/fail_compilation/warn12809.d
dmd-testsuite-ldc-v0.17.1/fail_compilation/warn13679.d
dmd-testsuite-ldc-v0.17.1/fail_compilation/warn7444.d
dmd-testsuite-ldc-v0.17.1/runnable/
dmd-testsuite-ldc-v0.17.1/runnable/A16.d
dmd-testsuite-ldc-v0.17.1/runnable/Same.d
dmd-testsuite-ldc-v0.17.1/runnable/a17.d
dmd-testsuite-ldc-v0.17.1/runnable/a18.d
dmd-testsuite-ldc-v0.17.1/runnable/a19.d
dmd-testsuite-ldc-v0.17.1/runnable/a20.d
dmd-testsuite-ldc-v0.17.1/runnable/a21.d
dmd-testsuite-ldc-v0.17.1/runnable/aliasthis.d
dmd-testsuite-ldc-v0.17.1/runnable/argufilem.d
dmd-testsuite-ldc-v0.17.1/runnable/arrayop.d
dmd-testsuite-ldc-v0.17.1/runnable/auto1.d
dmd-testsuite-ldc-v0.17.1/runnable/b26.d
dmd-testsuite-ldc-v0.17.1/runnable/bench1.d
dmd-testsuite-ldc-v0.17.1/runnable/bitops.d
dmd-testsuite-ldc-v0.17.1/runnable/bug11155.d
dmd-testsuite-ldc-v0.17.1/runnable/bug12928.d
dmd-testsuite-ldc-v0.17.1/runnable/bug5.d
dmd-testsuite-ldc-v0.17.1/runnable/bug7068.d
dmd-testsuite-ldc-v0.17.1/runnable/bug846.d
dmd-testsuite-ldc-v0.17.1/runnable/bug9010.d
dmd-testsuite-ldc-v0.17.1/runnable/builtin.d
dmd-testsuite-ldc-v0.17.1/runnable/c22.d
dmd-testsuite-ldc-v0.17.1/runnable/cabi1.d
dmd-testsuite-ldc-v0.17.1/runnable/casting.d
dmd-testsuite-ldc-v0.17.1/runnable/circular.d
dmd-testsuite-ldc-v0.17.1/runnable/closure.d
dmd-testsuite-ldc-v0.17.1/runnable/complex.d
dmd-testsuite-ldc-v0.17.1/runnable/constfold.d
dmd-testsuite-ldc-v0.17.1/runnable/cov2.d
dmd-testsuite-ldc-v0.17.1/runnable/cppa.d
dmd-testsuite-ldc-v0.17.1/runnable/cppmangle1.d
dmd-testsuite-ldc-v0.17.1/runnable/ctorpowtests.d
dmd-testsuite-ldc-v0.17.1/runnable/declaration.d
dmd-testsuite-ldc-v0.17.1/runnable/delegate.d
dmd-testsuite-ldc-v0.17.1/runnable/depsprot.sh
dmd-testsuite-ldc-v0.17.1/runnable/dhry.d
dmd-testsuite-ldc-v0.17.1/runnable/eh.d
dmd-testsuite-ldc-v0.17.1/runnable/eh2.d
dmd-testsuite-ldc-v0.17.1/runnable/entity1.d
dmd-testsuite-ldc-v0.17.1/runnable/extern1.d
dmd-testsuite-ldc-v0.17.1/runnable/externmangle.d
dmd-testsuite-ldc-v0.17.1/runnable/externmangle2.d
dmd-testsuite-ldc-v0.17.1/runnable/extra-files/
dmd-testsuite-ldc-v0.17.1/runnable/extra-files/a20-postscript.sh
dmd-testsuite-ldc-v0.17.1/runnable/extra-files/alice30.txt
dmd-testsuite-ldc-v0.17.1/runnable/extra-files/bug9010-postscript.sh
dmd-testsuite-ldc-v0.17.1/runnable/extra-files/cabi2.cpp
dmd-testsuite-ldc-v0.17.1/runnable/extra-files/cov2-postscript.sh
dmd-testsuite-ldc-v0.17.1/runnable/extra-files/cppb.cpp
dmd-testsuite-ldc-v0.17.1/runnable/extra-files/cppmangle1.cpp
dmd-testsuite-ldc-v0.17.1/runnable/extra-files/depsprot.d
dmd-testsuite-ldc-v0.17.1/runnable/extra-files/externmangle.cpp
dmd-testsuite-ldc-v0.17.1/runnable/extra-files/externmangle2.cpp
dmd-testsuite-ldc-v0.17.1/runnable/extra-files/foo37.txt
dmd-testsuite-ldc-v0.17.1/runnable/extra-files/hello-profile-postscript.sh
dmd-testsuite-ldc-v0.17.1/runnable/extra-files/hello-profile.d.trace.def
dmd-testsuite-ldc-v0.17.1/runnable/extra-files/ldc_cabi2.cpp
dmd-testsuite-ldc-v0.17.1/runnable/extra-files/lib10386/
dmd-testsuite-ldc-v0.17.1/runnable/extra-files/lib10386/foo/
dmd-testsuite-ldc-v0.17.1/runnable/extra-files/lib10386/foo/bar.d
dmd-testsuite-ldc-v0.17.1/runnable/extra-files/lib10386/foo/package.d
dmd-testsuite-ldc-v0.17.1/runnable/extra-files/lib13666.d
dmd-testsuite-ldc-v0.17.1/runnable/extra-files/lib13774a.d
dmd-testsuite-ldc-v0.17.1/runnable/extra-files/lib13774b.d
dmd-testsuite-ldc-v0.17.1/runnable/extra-files/lib846.d
dmd-testsuite-ldc-v0.17.1/runnable/extra-files/link14834a.d
dmd-testsuite-ldc-v0.17.1/runnable/extra-files/link14834b.d
dmd-testsuite-ldc-v0.17.1/runnable/extra-files/linkdebug.d
dmd-testsuite-ldc-v0.17.1/runnable/extra-files/linkdebug_primitives.d
dmd-testsuite-ldc-v0.17.1/runnable/extra-files/linkdebug_range.d
dmd-testsuite-ldc-v0.17.1/runnable/extra-files/linkdebug_uni.d
dmd-testsuite-ldc-v0.17.1/runnable/extra-files/main846.d
dmd-testsuite-ldc-v0.17.1/runnable/extra-files/mul9377a.d
dmd-testsuite-ldc-v0.17.1/runnable/extra-files/mul9377b.d
dmd-testsuite-ldc-v0.17.1/runnable/extra-files/multi9377.d
dmd-testsuite-ldc-v0.17.1/runnable/extra-files/objc_self_test.m
dmd-testsuite-ldc-v0.17.1/runnable/extra-files/runnable-a20.lst
dmd-testsuite-ldc-v0.17.1/runnable/extra-files/runnable-bug9010.lst
dmd-testsuite-ldc-v0.17.1/runnable/extra-files/runnable-cov2.lst
dmd-testsuite-ldc-v0.17.1/runnable/extra-files/runnable-sieve.lst
dmd-testsuite-ldc-v0.17.1/runnable/extra-files/sieve-postscript.sh
dmd-testsuite-ldc-v0.17.1/runnable/extra-files/statictor-postscript.sh
dmd-testsuite-ldc-v0.17.1/runnable/extra-files/statictor.d.out
dmd-testsuite-ldc-v0.17.1/runnable/extra-files/std14198/
dmd-testsuite-ldc-v0.17.1/runnable/extra-files/std14198/array.d
dmd-testsuite-ldc-v0.17.1/runnable/extra-files/std14198/conv.d
dmd-testsuite-ldc-v0.17.1/runnable/extra-files/std14198/format.d
dmd-testsuite-ldc-v0.17.1/runnable/extra-files/std14198/uni.d
dmd-testsuite-ldc-v0.17.1/runnable/extra-files/test10386.d
dmd-testsuite-ldc-v0.17.1/runnable/extra-files/test10567.d
dmd-testsuite-ldc-v0.17.1/runnable/extra-files/test10567a.d
dmd-testsuite-ldc-v0.17.1/runnable/extra-files/test13666.d
dmd-testsuite-ldc-v0.17.1/runnable/extra-files/test14198.d
dmd-testsuite-ldc-v0.17.1/runnable/extra-files/test15.txt
dmd-testsuite-ldc-v0.17.1/runnable/extra-files/test2.d
dmd-testsuite-ldc-v0.17.1/runnable/extra-files/test35.d
dmd-testsuite-ldc-v0.17.1/runnable/extra-files/test39.d
dmd-testsuite-ldc-v0.17.1/runnable/extra-files/test44.d
dmd-testsuite-ldc-v0.17.1/runnable/extra-files/test_shared.d
dmd-testsuite-ldc-v0.17.1/runnable/extra-files/teststdio.txt
dmd-testsuite-ldc-v0.17.1/runnable/extra-files/testzip-postscript.sh
dmd-testsuite-ldc-v0.17.1/runnable/extra-files/testzip.zip
dmd-testsuite-ldc-v0.17.1/runnable/extra-files/untag.html
dmd-testsuite-ldc-v0.17.1/runnable/foreach.d
dmd-testsuite-ldc-v0.17.1/runnable/foreach2.d
dmd-testsuite-ldc-v0.17.1/runnable/foreach3.d
dmd-testsuite-ldc-v0.17.1/runnable/foreach4.d
dmd-testsuite-ldc-v0.17.1/runnable/foreach5.d
dmd-testsuite-ldc-v0.17.1/runnable/funclit.d
dmd-testsuite-ldc-v0.17.1/runnable/functype.d
dmd-testsuite-ldc-v0.17.1/runnable/gdb1.d
dmd-testsuite-ldc-v0.17.1/runnable/gdb10311.d
dmd-testsuite-ldc-v0.17.1/runnable/gdb14225.d
dmd-testsuite-ldc-v0.17.1/runnable/gdb14276.d
dmd-testsuite-ldc-v0.17.1/runnable/gdb14313.d
dmd-testsuite-ldc-v0.17.1/runnable/gdb14330.d
dmd-testsuite-ldc-v0.17.1/runnable/gdb4149.d
dmd-testsuite-ldc-v0.17.1/runnable/gdb4181.d
dmd-testsuite-ldc-v0.17.1/runnable/hello-profile.d
dmd-testsuite-ldc-v0.17.1/runnable/hello.d
dmd-testsuite-ldc-v0.17.1/runnable/helloUTF16.d
dmd-testsuite-ldc-v0.17.1/runnable/helloUTF16BE.d
dmd-testsuite-ldc-v0.17.1/runnable/helloUTF8.d
dmd-testsuite-ldc-v0.17.1/runnable/hospital.d
dmd-testsuite-ldc-v0.17.1/runnable/iasm.d
dmd-testsuite-ldc-v0.17.1/runnable/iasm64.d
dmd-testsuite-ldc-v0.17.1/runnable/ice10086a.d
dmd-testsuite-ldc-v0.17.1/runnable/ice10086b.d
dmd-testsuite-ldc-v0.17.1/runnable/ice10857.d
dmd-testsuite-ldc-v0.17.1/runnable/ice15030.d
dmd-testsuite-ldc-v0.17.1/runnable/ice4481.d
dmd-testsuite-ldc-v0.17.1/runnable/ifti.d
dmd-testsuite-ldc-v0.17.1/runnable/implicit.d
dmd-testsuite-ldc-v0.17.1/runnable/imports/
dmd-testsuite-ldc-v0.17.1/runnable/imports/A16a.d
dmd-testsuite-ldc-v0.17.1/runnable/imports/Other.d
dmd-testsuite-ldc-v0.17.1/runnable/imports/a11447.d
dmd-testsuite-ldc-v0.17.1/runnable/imports/a12010.d
dmd-testsuite-ldc-v0.17.1/runnable/imports/a12037.d
dmd-testsuite-ldc-v0.17.1/runnable/imports/a12874.d
dmd-testsuite-ldc-v0.17.1/runnable/imports/a14267.d
dmd-testsuite-ldc-v0.17.1/runnable/imports/a15030.d
dmd-testsuite-ldc-v0.17.1/runnable/imports/a17a.d
dmd-testsuite-ldc-v0.17.1/runnable/imports/a18a.d
dmd-testsuite-ldc-v0.17.1/runnable/imports/a19a.d
dmd-testsuite-ldc-v0.17.1/runnable/imports/a20a.d
dmd-testsuite-ldc-v0.17.1/runnable/imports/a21a.d
dmd-testsuite-ldc-v0.17.1/runnable/imports/a7595.d
dmd-testsuite-ldc-v0.17.1/runnable/imports/a9546.d
dmd-testsuite-ldc-v0.17.1/runnable/imports/a9741.d
dmd-testsuite-ldc-v0.17.1/runnable/imports/argufile.d
dmd-testsuite-ldc-v0.17.1/runnable/imports/b11447.d
dmd-testsuite-ldc-v0.17.1/runnable/imports/b15030.d
dmd-testsuite-ldc-v0.17.1/runnable/imports/b26a.d
dmd-testsuite-ldc-v0.17.1/runnable/imports/bug10425.d
dmd-testsuite-ldc-v0.17.1/runnable/imports/bug846.d
dmd-testsuite-ldc-v0.17.1/runnable/imports/c11447.d
dmd-testsuite-ldc-v0.17.1/runnable/imports/c22a.d
dmd-testsuite-ldc-v0.17.1/runnable/imports/c22b.d
dmd-testsuite-ldc-v0.17.1/runnable/imports/circularA.d
dmd-testsuite-ldc-v0.17.1/runnable/imports/depsprot_default.d
dmd-testsuite-ldc-v0.17.1/runnable/imports/depsprot_private.d
dmd-testsuite-ldc-v0.17.1/runnable/imports/depsprot_public.d
dmd-testsuite-ldc-v0.17.1/runnable/imports/extern1a.d
dmd-testsuite-ldc-v0.17.1/runnable/imports/ice10086x.d
dmd-testsuite-ldc-v0.17.1/runnable/imports/ice10086y.d
dmd-testsuite-ldc-v0.17.1/runnable/imports/ice10857a.d
dmd-testsuite-ldc-v0.17.1/runnable/imports/ice10857b.d
dmd-testsuite-ldc-v0.17.1/runnable/imports/ice4481a.d
dmd-testsuite-ldc-v0.17.1/runnable/imports/ice4481b.d
dmd-testsuite-ldc-v0.17.1/runnable/imports/inc11239.d
dmd-testsuite-ldc-v0.17.1/runnable/imports/inline2a.d
dmd-testsuite-ldc-v0.17.1/runnable/imports/ldc_github_131_1a.d
dmd-testsuite-ldc-v0.17.1/runnable/imports/ldc_github_131_2a.d
dmd-testsuite-ldc-v0.17.1/runnable/imports/ldc_github_217a.d
dmd-testsuite-ldc-v0.17.1/runnable/imports/link10920a.d
dmd-testsuite-ldc-v0.17.1/runnable/imports/link11069x.d
dmd-testsuite-ldc-v0.17.1/runnable/imports/link11069y.d
dmd-testsuite-ldc-v0.17.1/runnable/imports/link11069z.d
dmd-testsuite-ldc-v0.17.1/runnable/imports/link11127a.d
dmd-testsuite-ldc-v0.17.1/runnable/imports/link11395a.d
dmd-testsuite-ldc-v0.17.1/runnable/imports/link12144a.d
dmd-testsuite-ldc-v0.17.1/runnable/imports/link13043a.d
dmd-testsuite-ldc-v0.17.1/runnable/imports/link13394a.d
dmd-testsuite-ldc-v0.17.1/runnable/imports/link13400a.d
dmd-testsuite-ldc-v0.17.1/runnable/imports/link13415a.d
dmd-testsuite-ldc-v0.17.1/runnable/imports/link14074x.d
dmd-testsuite-ldc-v0.17.1/runnable/imports/link14074y.d
dmd-testsuite-ldc-v0.17.1/runnable/imports/link14074z.d
dmd-testsuite-ldc-v0.17.1/runnable/imports/link14541traits.d
dmd-testsuite-ldc-v0.17.1/runnable/imports/link14588a.d
dmd-testsuite-ldc-v0.17.1/runnable/imports/link14814a.d
dmd-testsuite-ldc-v0.17.1/runnable/imports/link2500a.d
dmd-testsuite-ldc-v0.17.1/runnable/imports/link2500b.d
dmd-testsuite-ldc-v0.17.1/runnable/imports/link2644a.d
dmd-testsuite-ldc-v0.17.1/runnable/imports/link2644b.d
dmd-testsuite-ldc-v0.17.1/runnable/imports/link2644c.d
dmd-testsuite-ldc-v0.17.1/runnable/imports/link7745b.d
dmd-testsuite-ldc-v0.17.1/runnable/imports/link8023b.d
dmd-testsuite-ldc-v0.17.1/runnable/imports/link9571a.d
dmd-testsuite-ldc-v0.17.1/runnable/imports/linktypeinfo_file.d
dmd-testsuite-ldc-v0.17.1/runnable/imports/m1a.d
dmd-testsuite-ldc-v0.17.1/runnable/imports/m8668a.d
dmd-testsuite-ldc-v0.17.1/runnable/imports/m8668b.d
dmd-testsuite-ldc-v0.17.1/runnable/imports/m8668c.d
dmd-testsuite-ldc-v0.17.1/runnable/imports/mangle10077.d
dmd-testsuite-ldc-v0.17.1/runnable/imports/mod2.d
dmd-testsuite-ldc-v0.17.1/runnable/imports/ovs1528a.d
dmd-testsuite-ldc-v0.17.1/runnable/imports/ovs1528b.d
dmd-testsuite-ldc-v0.17.1/runnable/imports/std11069array.d
dmd-testsuite-ldc-v0.17.1/runnable/imports/std11069container.d
dmd-testsuite-ldc-v0.17.1/runnable/imports/std11069range.d
dmd-testsuite-ldc-v0.17.1/runnable/imports/std11069typecons.d
dmd-testsuite-ldc-v0.17.1/runnable/imports/std11863bitmanip.d
dmd-testsuite-ldc-v0.17.1/runnable/imports/std11863conv.d
dmd-testsuite-ldc-v0.17.1/runnable/imports/std11863format.d
dmd-testsuite-ldc-v0.17.1/runnable/imports/std12010container.d
dmd-testsuite-ldc-v0.17.1/runnable/imports/std15017variant.d
dmd-testsuite-ldc-v0.17.1/runnable/imports/std15021conv.d
dmd-testsuite-ldc-v0.17.1/runnable/imports/std15021format.d
dmd-testsuite-ldc-v0.17.1/runnable/imports/std15030algo.d
dmd-testsuite-ldc-v0.17.1/runnable/imports/template13478a.d
dmd-testsuite-ldc-v0.17.1/runnable/imports/template13478b.d
dmd-testsuite-ldc-v0.17.1/runnable/imports/template2962a.d
dmd-testsuite-ldc-v0.17.1/runnable/imports/template_ovs1.d
dmd-testsuite-ldc-v0.17.1/runnable/imports/template_ovs2.d
dmd-testsuite-ldc-v0.17.1/runnable/imports/template_ovs3.d
dmd-testsuite-ldc-v0.17.1/runnable/imports/test10441b.d
dmd-testsuite-ldc-v0.17.1/runnable/imports/test10441c.d
dmd-testsuite-ldc-v0.17.1/runnable/imports/test10573a.d
dmd-testsuite-ldc-v0.17.1/runnable/imports/test10736a.d
dmd-testsuite-ldc-v0.17.1/runnable/imports/test10736b.d
dmd-testsuite-ldc-v0.17.1/runnable/imports/test10736c.d
dmd-testsuite-ldc-v0.17.1/runnable/imports/test10a.d
dmd-testsuite-ldc-v0.17.1/runnable/imports/test11039b.d
dmd-testsuite-ldc-v0.17.1/runnable/imports/test11745b.d
dmd-testsuite-ldc-v0.17.1/runnable/imports/test11931a.d
dmd-testsuite-ldc-v0.17.1/runnable/imports/test11931b.d
dmd-testsuite-ldc-v0.17.1/runnable/imports/test11931c.d
dmd-testsuite-ldc-v0.17.1/runnable/imports/test11931d.d
dmd-testsuite-ldc-v0.17.1/runnable/imports/test13a.d
dmd-testsuite-ldc-v0.17.1/runnable/imports/test14901a.d
dmd-testsuite-ldc-v0.17.1/runnable/imports/test14901b.d
dmd-testsuite-ldc-v0.17.1/runnable/imports/test14901c.d
dmd-testsuite-ldc-v0.17.1/runnable/imports/test14901d.d
dmd-testsuite-ldc-v0.17.1/runnable/imports/test21a.d
dmd-testsuite-ldc-v0.17.1/runnable/imports/test24a.d
dmd-testsuite-ldc-v0.17.1/runnable/imports/test24b.d
dmd-testsuite-ldc-v0.17.1/runnable/imports/test27a.d
dmd-testsuite-ldc-v0.17.1/runnable/imports/test29a.d
dmd-testsuite-ldc-v0.17.1/runnable/imports/test29b.d
dmd-testsuite-ldc-v0.17.1/runnable/imports/test31a.d
dmd-testsuite-ldc-v0.17.1/runnable/imports/test32a.d
dmd-testsuite-ldc-v0.17.1/runnable/imports/test35a.d
dmd-testsuite-ldc-v0.17.1/runnable/imports/test38a.d
dmd-testsuite-ldc-v0.17.1/runnable/imports/test39a.d
dmd-testsuite-ldc-v0.17.1/runnable/imports/test3a.d
dmd-testsuite-ldc-v0.17.1/runnable/imports/test3b.d
dmd-testsuite-ldc-v0.17.1/runnable/imports/test40a.d
dmd-testsuite-ldc-v0.17.1/runnable/imports/test41a.d
dmd-testsuite-ldc-v0.17.1/runnable/imports/test44a.d
dmd-testsuite-ldc-v0.17.1/runnable/imports/test45a.d
dmd-testsuite-ldc-v0.17.1/runnable/imports/test45b.d
dmd-testsuite-ldc-v0.17.1/runnable/imports/test46a.d
dmd-testsuite-ldc-v0.17.1/runnable/imports/test46b.d
dmd-testsuite-ldc-v0.17.1/runnable/imports/test46c.d
dmd-testsuite-ldc-v0.17.1/runnable/imports/test48a.d
dmd-testsuite-ldc-v0.17.1/runnable/imports/test49a.d
dmd-testsuite-ldc-v0.17.1/runnable/imports/test57a.d
dmd-testsuite-ldc-v0.17.1/runnable/imports/test57b.d
dmd-testsuite-ldc-v0.17.1/runnable/imports/test58a.d
dmd-testsuite-ldc-v0.17.1/runnable/imports/test61a.d
dmd-testsuite-ldc-v0.17.1/runnable/imports/test7494a.d
dmd-testsuite-ldc-v0.17.1/runnable/imports/test8997a.d
dmd-testsuite-ldc-v0.17.1/runnable/imports/test9271a.d
dmd-testsuite-ldc-v0.17.1/runnable/imports/testkwd_file.d
dmd-testsuite-ldc-v0.17.1/runnable/imports/testminitAA.d
dmd-testsuite-ldc-v0.17.1/runnable/imports/testminitBB.d
dmd-testsuite-ldc-v0.17.1/runnable/imports/testmod1a.d
dmd-testsuite-ldc-v0.17.1/runnable/imports/testmod1b.d
dmd-testsuite-ldc-v0.17.1/runnable/imports/testmod2a.d
dmd-testsuite-ldc-v0.17.1/runnable/imports/tlsa.d
dmd-testsuite-ldc-v0.17.1/runnable/imports/traits_getUnitTests_import.d
dmd-testsuite-ldc-v0.17.1/runnable/imports/ufcs5a.d
dmd-testsuite-ldc-v0.17.1/runnable/imports/ufcs5b.d
dmd-testsuite-ldc-v0.17.1/runnable/imports/ufcs5c.d
dmd-testsuite-ldc-v0.17.1/runnable/imports/ufcs5d.d
dmd-testsuite-ldc-v0.17.1/runnable/imports/ufcs5e.d
dmd-testsuite-ldc-v0.17.1/runnable/inline.d
dmd-testsuite-ldc-v0.17.1/runnable/inline14560.d
dmd-testsuite-ldc-v0.17.1/runnable/inline2.d
dmd-testsuite-ldc-v0.17.1/runnable/inner.d
dmd-testsuite-ldc-v0.17.1/runnable/integrate.d
dmd-testsuite-ldc-v0.17.1/runnable/interface.d
dmd-testsuite-ldc-v0.17.1/runnable/interface1.d
dmd-testsuite-ldc-v0.17.1/runnable/interface2.d
dmd-testsuite-ldc-v0.17.1/runnable/interface3.d
dmd-testsuite-ldc-v0.17.1/runnable/interpret.d
dmd-testsuite-ldc-v0.17.1/runnable/interpret2.d
dmd-testsuite-ldc-v0.17.1/runnable/issue8671.d
dmd-testsuite-ldc-v0.17.1/runnable/lazy.d
dmd-testsuite-ldc-v0.17.1/runnable/ldc_cabi1.d
dmd-testsuite-ldc-v0.17.1/runnable/ldc_contracts.d
dmd-testsuite-ldc-v0.17.1/runnable/ldc_eh.d
dmd-testsuite-ldc-v0.17.1/runnable/ldc_enum.d
dmd-testsuite-ldc-v0.17.1/runnable/ldc_extern_weak.d
dmd-testsuite-ldc-v0.17.1/runnable/ldc_github_1033.d
dmd-testsuite-ldc-v0.17.1/runnable/ldc_github_1058.d
dmd-testsuite-ldc-v0.17.1/runnable/ldc_github_1101.d
dmd-testsuite-ldc-v0.17.1/runnable/ldc_github_1141.d
dmd-testsuite-ldc-v0.17.1/runnable/ldc_github_119.d
dmd-testsuite-ldc-v0.17.1/runnable/ldc_github_131_1.d
dmd-testsuite-ldc-v0.17.1/runnable/ldc_github_131_2.d
dmd-testsuite-ldc-v0.17.1/runnable/ldc_github_176.d
dmd-testsuite-ldc-v0.17.1/runnable/ldc_github_179.d
dmd-testsuite-ldc-v0.17.1/runnable/ldc_github_214.d
dmd-testsuite-ldc-v0.17.1/runnable/ldc_github_217.d
dmd-testsuite-ldc-v0.17.1/runnable/ldc_github_246.d
dmd-testsuite-ldc-v0.17.1/runnable/ldc_github_248.d
dmd-testsuite-ldc-v0.17.1/runnable/ldc_github_328.d
dmd-testsuite-ldc-v0.17.1/runnable/ldc_github_340.d
dmd-testsuite-ldc-v0.17.1/runnable/ldc_github_420.d
dmd-testsuite-ldc-v0.17.1/runnable/ldc_github_424.d
dmd-testsuite-ldc-v0.17.1/runnable/ldc_github_426.d
dmd-testsuite-ldc-v0.17.1/runnable/ldc_github_430.d
dmd-testsuite-ldc-v0.17.1/runnable/ldc_github_440.d
dmd-testsuite-ldc-v0.17.1/runnable/ldc_github_513.d
dmd-testsuite-ldc-v0.17.1/runnable/ldc_github_556.d
dmd-testsuite-ldc-v0.17.1/runnable/ldc_github_726.d
dmd-testsuite-ldc-v0.17.1/runnable/ldc_github_795.d
dmd-testsuite-ldc-v0.17.1/runnable/ldc_github_809.d
dmd-testsuite-ldc-v0.17.1/runnable/ldc_github_812.d
dmd-testsuite-ldc-v0.17.1/runnable/ldc_github_944.d
dmd-testsuite-ldc-v0.17.1/runnable/ldc_github_989.d
dmd-testsuite-ldc-v0.17.1/runnable/ldc_intrinsics.d
dmd-testsuite-ldc-v0.17.1/runnable/ldc_llvm_inline_ir.d
dmd-testsuite-ldc-v0.17.1/runnable/ldc_no_gc.d
dmd-testsuite-ldc-v0.17.1/runnable/lexer.d
dmd-testsuite-ldc-v0.17.1/runnable/link10425.d
dmd-testsuite-ldc-v0.17.1/runnable/link10920.d
dmd-testsuite-ldc-v0.17.1/runnable/link11069a.d
dmd-testsuite-ldc-v0.17.1/runnable/link11069b.d
dmd-testsuite-ldc-v0.17.1/runnable/link11127.d
dmd-testsuite-ldc-v0.17.1/runnable/link11395.d
dmd-testsuite-ldc-v0.17.1/runnable/link11931.d
dmd-testsuite-ldc-v0.17.1/runnable/link12010.d
dmd-testsuite-ldc-v0.17.1/runnable/link12037.d
dmd-testsuite-ldc-v0.17.1/runnable/link12144.d
dmd-testsuite-ldc-v0.17.1/runnable/link13043.d
dmd-testsuite-ldc-v0.17.1/runnable/link13350.d
dmd-testsuite-ldc-v0.17.1/runnable/link13394.d
dmd-testsuite-ldc-v0.17.1/runnable/link13400.d
dmd-testsuite-ldc-v0.17.1/runnable/link13415.d
dmd-testsuite-ldc-v0.17.1/runnable/link13843.d
dmd-testsuite-ldc-v0.17.1/runnable/link14074a.d
dmd-testsuite-ldc-v0.17.1/runnable/link14074b.d
dmd-testsuite-ldc-v0.17.1/runnable/link14198a.sh
dmd-testsuite-ldc-v0.17.1/runnable/link14198b.sh
dmd-testsuite-ldc-v0.17.1/runnable/link14425.d
dmd-testsuite-ldc-v0.17.1/runnable/link14541.d
dmd-testsuite-ldc-v0.17.1/runnable/link14588.d
dmd-testsuite-ldc-v0.17.1/runnable/link14814.d
dmd-testsuite-ldc-v0.17.1/runnable/link14834.sh
dmd-testsuite-ldc-v0.17.1/runnable/link15017.d
dmd-testsuite-ldc-v0.17.1/runnable/link15021.d
dmd-testsuite-ldc-v0.17.1/runnable/link2500.d
dmd-testsuite-ldc-v0.17.1/runnable/link2644.d
dmd-testsuite-ldc-v0.17.1/runnable/link6574.d
dmd-testsuite-ldc-v0.17.1/runnable/link7745.d
dmd-testsuite-ldc-v0.17.1/runnable/link7966.d
dmd-testsuite-ldc-v0.17.1/runnable/link8023.d
dmd-testsuite-ldc-v0.17.1/runnable/link846.sh
dmd-testsuite-ldc-v0.17.1/runnable/link9571.d
dmd-testsuite-ldc-v0.17.1/runnable/linkdebug.sh
dmd-testsuite-ldc-v0.17.1/runnable/linktypeinfo.d
dmd-testsuite-ldc-v0.17.1/runnable/literal.d
dmd-testsuite-ldc-v0.17.1/runnable/m1.d
dmd-testsuite-ldc-v0.17.1/runnable/manboy.d
dmd-testsuite-ldc-v0.17.1/runnable/mangle.d
dmd-testsuite-ldc-v0.17.1/runnable/mars1.d
dmd-testsuite-ldc-v0.17.1/runnable/mixin1.d
dmd-testsuite-ldc-v0.17.1/runnable/mixin2.d
dmd-testsuite-ldc-v0.17.1/runnable/mod1.d
dmd-testsuite-ldc-v0.17.1/runnable/nan.d
dmd-testsuite-ldc-v0.17.1/runnable/nested.d
dmd-testsuite-ldc-v0.17.1/runnable/newdel.d
dmd-testsuite-ldc-v0.17.1/runnable/nogc.d
dmd-testsuite-ldc-v0.17.1/runnable/nulltype.d
dmd-testsuite-ldc-v0.17.1/runnable/objc_self_test.d
dmd-testsuite-ldc-v0.17.1/runnable/opdisp.d
dmd-testsuite-ldc-v0.17.1/runnable/opover.d
dmd-testsuite-ldc-v0.17.1/runnable/opover2.d
dmd-testsuite-ldc-v0.17.1/runnable/opover3.d
dmd-testsuite-ldc-v0.17.1/runnable/overload.d
dmd-testsuite-ldc-v0.17.1/runnable/pi.d
dmd-testsuite-ldc-v0.17.1/runnable/polysemous.d
dmd-testsuite-ldc-v0.17.1/runnable/printargs.d
dmd-testsuite-ldc-v0.17.1/runnable/property.d
dmd-testsuite-ldc-v0.17.1/runnable/property2.d
dmd-testsuite-ldc-v0.17.1/runnable/s2ir.d
dmd-testsuite-ldc-v0.17.1/runnable/sctor.d
dmd-testsuite-ldc-v0.17.1/runnable/sdtor.d
dmd-testsuite-ldc-v0.17.1/runnable/sieve.d
dmd-testsuite-ldc-v0.17.1/runnable/statictor.d
dmd-testsuite-ldc-v0.17.1/runnable/stress.d
dmd-testsuite-ldc-v0.17.1/runnable/structlit.d
dmd-testsuite-ldc-v0.17.1/runnable/template1.d
dmd-testsuite-ldc-v0.17.1/runnable/template13478.d
dmd-testsuite-ldc-v0.17.1/runnable/template2.d
dmd-testsuite-ldc-v0.17.1/runnable/template2962.d
dmd-testsuite-ldc-v0.17.1/runnable/template3.d
dmd-testsuite-ldc-v0.17.1/runnable/template4.d
dmd-testsuite-ldc-v0.17.1/runnable/template6.d
dmd-testsuite-ldc-v0.17.1/runnable/template8.d
dmd-testsuite-ldc-v0.17.1/runnable/template9.d
dmd-testsuite-ldc-v0.17.1/runnable/test10.d
dmd-testsuite-ldc-v0.17.1/runnable/test10386.sh
dmd-testsuite-ldc-v0.17.1/runnable/test10441.d
dmd-testsuite-ldc-v0.17.1/runnable/test10567.sh
dmd-testsuite-ldc-v0.17.1/runnable/test10573.d
dmd-testsuite-ldc-v0.17.1/runnable/test10736.d
dmd-testsuite-ldc-v0.17.1/runnable/test10942.d
dmd-testsuite-ldc-v0.17.1/runnable/test11.d
dmd-testsuite-ldc-v0.17.1/runnable/test11039.d
dmd-testsuite-ldc-v0.17.1/runnable/test11239.d
dmd-testsuite-ldc-v0.17.1/runnable/test11447a.d
dmd-testsuite-ldc-v0.17.1/runnable/test11447b.d
dmd-testsuite-ldc-v0.17.1/runnable/test11447c.d
dmd-testsuite-ldc-v0.17.1/runnable/test11745.d
dmd-testsuite-ldc-v0.17.1/runnable/test11863.d
dmd-testsuite-ldc-v0.17.1/runnable/test12.d
dmd-testsuite-ldc-v0.17.1/runnable/test12197.d
dmd-testsuite-ldc-v0.17.1/runnable/test12874.d
dmd-testsuite-ldc-v0.17.1/runnable/test13.d
dmd-testsuite-ldc-v0.17.1/runnable/test13117.d
dmd-testsuite-ldc-v0.17.1/runnable/test13117b.d
dmd-testsuite-ldc-v0.17.1/runnable/test13504.d
dmd-testsuite-ldc-v0.17.1/runnable/test13613.d
dmd-testsuite-ldc-v0.17.1/runnable/test13666.sh
dmd-testsuite-ldc-v0.17.1/runnable/test13774.sh
dmd-testsuite-ldc-v0.17.1/runnable/test13944.d
dmd-testsuite-ldc-v0.17.1/runnable/test14901.d
dmd-testsuite-ldc-v0.17.1/runnable/test15.d
dmd-testsuite-ldc-v0.17.1/runnable/test16.d
dmd-testsuite-ldc-v0.17.1/runnable/test17.d
dmd-testsuite-ldc-v0.17.1/runnable/test19.d
dmd-testsuite-ldc-v0.17.1/runnable/test2.sh
dmd-testsuite-ldc-v0.17.1/runnable/test20.d
dmd-testsuite-ldc-v0.17.1/runnable/test21.d
dmd-testsuite-ldc-v0.17.1/runnable/test22.d
dmd-testsuite-ldc-v0.17.1/runnable/test23.d
dmd-testsuite-ldc-v0.17.1/runnable/test24.d
dmd-testsuite-ldc-v0.17.1/runnable/test27.d
dmd-testsuite-ldc-v0.17.1/runnable/test28.d
dmd-testsuite-ldc-v0.17.1/runnable/test29.d
dmd-testsuite-ldc-v0.17.1/runnable/test3.d
dmd-testsuite-ldc-v0.17.1/runnable/test30.d
dmd-testsuite-ldc-v0.17.1/runnable/test31.d
dmd-testsuite-ldc-v0.17.1/runnable/test32.d
dmd-testsuite-ldc-v0.17.1/runnable/test34.d
dmd-testsuite-ldc-v0.17.1/runnable/test3449.d
dmd-testsuite-ldc-v0.17.1/runnable/test35.sh
dmd-testsuite-ldc-v0.17.1/runnable/test3574a.d
dmd-testsuite-ldc-v0.17.1/runnable/test3574b.d
dmd-testsuite-ldc-v0.17.1/runnable/test3574c.d
dmd-testsuite-ldc-v0.17.1/runnable/test3574d.d
dmd-testsuite-ldc-v0.17.1/runnable/test36.d
dmd-testsuite-ldc-v0.17.1/runnable/test37.d
dmd-testsuite-ldc-v0.17.1/runnable/test38.d
dmd-testsuite-ldc-v0.17.1/runnable/test39.sh
dmd-testsuite-ldc-v0.17.1/runnable/test4.d
dmd-testsuite-ldc-v0.17.1/runnable/test40.d
dmd-testsuite-ldc-v0.17.1/runnable/test41.d
dmd-testsuite-ldc-v0.17.1/runnable/test42.d
dmd-testsuite-ldc-v0.17.1/runnable/test42a.d
dmd-testsuite-ldc-v0.17.1/runnable/test435.d
dmd-testsuite-ldc-v0.17.1/runnable/test44.sh
dmd-testsuite-ldc-v0.17.1/runnable/test45.d
dmd-testsuite-ldc-v0.17.1/runnable/test46.d
dmd-testsuite-ldc-v0.17.1/runnable/test48.d
dmd-testsuite-ldc-v0.17.1/runnable/test49.d
dmd-testsuite-ldc-v0.17.1/runnable/test5.d
dmd-testsuite-ldc-v0.17.1/runnable/test52.d
dmd-testsuite-ldc-v0.17.1/runnable/test57.d
dmd-testsuite-ldc-v0.17.1/runnable/test58.d
dmd-testsuite-ldc-v0.17.1/runnable/test5854.d
dmd-testsuite-ldc-v0.17.1/runnable/test5943.d
dmd-testsuite-ldc-v0.17.1/runnable/test60.d
dmd-testsuite-ldc-v0.17.1/runnable/test61.d
dmd-testsuite-ldc-v0.17.1/runnable/test6423.d
dmd-testsuite-ldc-v0.17.1/runnable/test7.d
dmd-testsuite-ldc-v0.17.1/runnable/test7452.d
dmd-testsuite-ldc-v0.17.1/runnable/test7453.d
dmd-testsuite-ldc-v0.17.1/runnable/test7494.d
dmd-testsuite-ldc-v0.17.1/runnable/test7511.d
dmd-testsuite-ldc-v0.17.1/runnable/test7595.d
dmd-testsuite-ldc-v0.17.1/runnable/test7603.d
dmd-testsuite-ldc-v0.17.1/runnable/test7618.d
dmd-testsuite-ldc-v0.17.1/runnable/test7932.d
dmd-testsuite-ldc-v0.17.1/runnable/test8.d
dmd-testsuite-ldc-v0.17.1/runnable/test8182.d
dmd-testsuite-ldc-v0.17.1/runnable/test8544.d
dmd-testsuite-ldc-v0.17.1/runnable/test8997.d
dmd-testsuite-ldc-v0.17.1/runnable/test9259.d
dmd-testsuite-ldc-v0.17.1/runnable/test9271.d
dmd-testsuite-ldc-v0.17.1/runnable/test9309.d
dmd-testsuite-ldc-v0.17.1/runnable/test9377.sh
dmd-testsuite-ldc-v0.17.1/runnable/test9495.d
dmd-testsuite-ldc-v0.17.1/runnable/testUTF32.d
dmd-testsuite-ldc-v0.17.1/runnable/test_shared.sh
dmd-testsuite-ldc-v0.17.1/runnable/testaa.d
dmd-testsuite-ldc-v0.17.1/runnable/testaa2.d
dmd-testsuite-ldc-v0.17.1/runnable/testaa3.d
dmd-testsuite-ldc-v0.17.1/runnable/testabi.d
dmd-testsuite-ldc-v0.17.1/runnable/testappend.d
dmd-testsuite-ldc-v0.17.1/runnable/testargtypes.d
dmd-testsuite-ldc-v0.17.1/runnable/testarray.d
dmd-testsuite-ldc-v0.17.1/runnable/testassign.d
dmd-testsuite-ldc-v0.17.1/runnable/testbitarray.d
dmd-testsuite-ldc-v0.17.1/runnable/testbounds.d
dmd-testsuite-ldc-v0.17.1/runnable/testbounds2.d
dmd-testsuite-ldc-v0.17.1/runnable/testbounds_off.d
dmd-testsuite-ldc-v0.17.1/runnable/testbounds_on.d
dmd-testsuite-ldc-v0.17.1/runnable/testbounds_safeonly.d
dmd-testsuite-ldc-v0.17.1/runnable/testclass.d
dmd-testsuite-ldc-v0.17.1/runnable/testconst.d
dmd-testsuite-ldc-v0.17.1/runnable/testconstsection.d
dmd-testsuite-ldc-v0.17.1/runnable/testcontracts.d
dmd-testsuite-ldc-v0.17.1/runnable/testdstress.d
dmd-testsuite-ldc-v0.17.1/runnable/testdt.d
dmd-testsuite-ldc-v0.17.1/runnable/testenum.d
dmd-testsuite-ldc-v0.17.1/runnable/testfile.d
dmd-testsuite-ldc-v0.17.1/runnable/testformat.d
dmd-testsuite-ldc-v0.17.1/runnable/testgc2.d
dmd-testsuite-ldc-v0.17.1/runnable/testgc3.d
dmd-testsuite-ldc-v0.17.1/runnable/testinvariant.d
dmd-testsuite-ldc-v0.17.1/runnable/testkeyword.d
dmd-testsuite-ldc-v0.17.1/runnable/testline.d
dmd-testsuite-ldc-v0.17.1/runnable/testmain.d
dmd-testsuite-ldc-v0.17.1/runnable/testminit.d
dmd-testsuite-ldc-v0.17.1/runnable/testmmfile.d
dmd-testsuite-ldc-v0.17.1/runnable/testmod1.d
dmd-testsuite-ldc-v0.17.1/runnable/testmod2.d
dmd-testsuite-ldc-v0.17.1/runnable/testmodule.d
dmd-testsuite-ldc-v0.17.1/runnable/testpic.d
dmd-testsuite-ldc-v0.17.1/runnable/testprofile.d
dmd-testsuite-ldc-v0.17.1/runnable/testreturn.d
dmd-testsuite-ldc-v0.17.1/runnable/testrightthis.d
dmd-testsuite-ldc-v0.17.1/runnable/testsafe.d
dmd-testsuite-ldc-v0.17.1/runnable/testscope.d
dmd-testsuite-ldc-v0.17.1/runnable/testscope2.d
dmd-testsuite-ldc-v0.17.1/runnable/testsignals.d
dmd-testsuite-ldc-v0.17.1/runnable/testsocket.d
dmd-testsuite-ldc-v0.17.1/runnable/teststdio.d
dmd-testsuite-ldc-v0.17.1/runnable/testswitch.d
dmd-testsuite-ldc-v0.17.1/runnable/testthread.d
dmd-testsuite-ldc-v0.17.1/runnable/testthread2.d
dmd-testsuite-ldc-v0.17.1/runnable/testtypeid.d
dmd-testsuite-ldc-v0.17.1/runnable/testv.d
dmd-testsuite-ldc-v0.17.1/runnable/testxmm.d
dmd-testsuite-ldc-v0.17.1/runnable/testzip.d
dmd-testsuite-ldc-v0.17.1/runnable/tls.d
dmd-testsuite-ldc-v0.17.1/runnable/tls_dup.d
dmd-testsuite-ldc-v0.17.1/runnable/traits.d
dmd-testsuite-ldc-v0.17.1/runnable/traits_getPointerBitmap.d
dmd-testsuite-ldc-v0.17.1/runnable/traits_getUnitTests.d
dmd-testsuite-ldc-v0.17.1/runnable/traits_getVirtualIndex.d
dmd-testsuite-ldc-v0.17.1/runnable/uda.d
dmd-testsuite-ldc-v0.17.1/runnable/ufcs.d
dmd-testsuite-ldc-v0.17.1/runnable/uniformctor.d
dmd-testsuite-ldc-v0.17.1/runnable/untag.d
dmd-testsuite-ldc-v0.17.1/runnable/variadic.d
dmd-testsuite-ldc-v0.17.1/runnable/version.d
dmd-testsuite-ldc-v0.17.1/runnable/warning1.d
dmd-testsuite-ldc-v0.17.1/runnable/wc.d
dmd-testsuite-ldc-v0.17.1/runnable/wc2.d
dmd-testsuite-ldc-v0.17.1/runnable/wc3.d
dmd-testsuite-ldc-v0.17.1/runnable/xdtor.d
dmd-testsuite-ldc-v0.17.1/runnable/xpostblit.d
dmd-testsuite-ldc-v0.17.1/runnable/xtest46.d
dmd-testsuite-ldc-v0.17.1/runnable/xtest55.d
dmd-testsuite-ldc-v0.17.1/runnable/xtestenum.d
dmd-testsuite-ldc-v0.17.1/win32/
dmd-testsuite-ldc-v0.17.1/win32/dll2.d
dmd-testsuite-ldc-v0.17.1/win32/mydll.d
dmd-testsuite-ldc-v0.17.1/win32/mydll.def
dmd-testsuite-ldc-v0.17.1/win32/mydll.di
dmd-testsuite-ldc-v0.17.1/win32/mydll2.d
dmd-testsuite-ldc-v0.17.1/win32/mydll2.def
dmd-testsuite-ldc-v0.17.1/win32/runtests.sh
dmd-testsuite-ldc-v0.17.1/win32/testmydll.d
dmd-testsuite-ldc-v0.17.1/win32/testmydll2.d
phase `unpack-submodule-sources' succeeded after 0.3 seconds
starting phase `patch-phobos'
phase `patch-phobos' succeeded after 0.3 seconds
starting phase `patch-dmd2'
phase `patch-dmd2' succeeded after 0.0 seconds
starting phase `patch-usr-bin-file'
phase `patch-usr-bin-file' succeeded after 0.0 seconds
starting phase `patch-source-shebangs'
patch-shebang: ./tests/d2/dmd-testsuite/compilable/ddoc9764.sh: changing `/usr/bin/env bash' to `/gnu/store/ykzwykkvr2c80rw4l1qh3mvfdkl7jibi-bash-4.3.42/bin/bash'
patch-shebang: ./tests/d2/dmd-testsuite/compilable/extra-files/ddocAny-postscript.sh: changing `/usr/bin/env bash' to `/gnu/store/ykzwykkvr2c80rw4l1qh3mvfdkl7jibi-bash-4.3.42/bin/bash'
patch-shebang: ./tests/d2/dmd-testsuite/compilable/extra-files/ddocYear-postscript.sh: changing `/usr/bin/env bash' to `/gnu/store/ykzwykkvr2c80rw4l1qh3mvfdkl7jibi-bash-4.3.42/bin/bash'
patch-shebang: ./tests/d2/dmd-testsuite/compilable/extra-files/depsOutput.sh: changing `/usr/bin/env bash' to `/gnu/store/ykzwykkvr2c80rw4l1qh3mvfdkl7jibi-bash-4.3.42/bin/bash'
patch-shebang: ./tests/d2/dmd-testsuite/compilable/extra-files/header-postscript.sh: changing `/usr/bin/env bash' to `/gnu/store/ykzwykkvr2c80rw4l1qh3mvfdkl7jibi-bash-4.3.42/bin/bash'
patch-shebang: ./tests/d2/dmd-testsuite/compilable/extra-files/json-postscript.sh: changing `/usr/bin/env bash' to `/gnu/store/ykzwykkvr2c80rw4l1qh3mvfdkl7jibi-bash-4.3.42/bin/bash'
patch-shebang: ./tests/d2/dmd-testsuite/compilable/extra-files/test11237.sh: changing `/usr/bin/env bash' to `/gnu/store/ykzwykkvr2c80rw4l1qh3mvfdkl7jibi-bash-4.3.42/bin/bash'
patch-shebang: ./tests/d2/dmd-testsuite/compilable/extra-files/test7754-postscript.sh: changing `/usr/bin/env bash' to `/gnu/store/ykzwykkvr2c80rw4l1qh3mvfdkl7jibi-bash-4.3.42/bin/bash'
patch-shebang: ./tests/d2/dmd-testsuite/compilable/test14894.sh: changing `/usr/bin/env bash' to `/gnu/store/ykzwykkvr2c80rw4l1qh3mvfdkl7jibi-bash-4.3.42/bin/bash'
patch-shebang: ./tests/d2/dmd-testsuite/compilable/test6461.sh: changing `/usr/bin/env bash' to `/gnu/store/ykzwykkvr2c80rw4l1qh3mvfdkl7jibi-bash-4.3.42/bin/bash'
patch-shebang: ./tests/d2/dmd-testsuite/compilable/test9680.sh: changing `/usr/bin/env bash' to `/gnu/store/ykzwykkvr2c80rw4l1qh3mvfdkl7jibi-bash-4.3.42/bin/bash'
patch-shebang: ./tests/d2/dmd-testsuite/do_test.sh: changing `/bin/bash' to `/gnu/store/ykzwykkvr2c80rw4l1qh3mvfdkl7jibi-bash-4.3.42/bin/bash'
patch-shebang: ./tests/d2/dmd-testsuite/runnable/constfold.d: warning: no binary for interpreter `blah' found in $PATH
patch-shebang: ./tests/d2/dmd-testsuite/runnable/depsprot.sh: changing `/usr/bin/env bash' to `/gnu/store/ykzwykkvr2c80rw4l1qh3mvfdkl7jibi-bash-4.3.42/bin/bash'
patch-shebang: ./tests/d2/dmd-testsuite/runnable/extra-files/a20-postscript.sh: changing `/usr/bin/env bash' to `/gnu/store/ykzwykkvr2c80rw4l1qh3mvfdkl7jibi-bash-4.3.42/bin/bash'
patch-shebang: ./tests/d2/dmd-testsuite/runnable/extra-files/bug9010-postscript.sh: changing `/usr/bin/env bash' to `/gnu/store/ykzwykkvr2c80rw4l1qh3mvfdkl7jibi-bash-4.3.42/bin/bash'
patch-shebang: ./tests/d2/dmd-testsuite/runnable/extra-files/cov2-postscript.sh: changing `/usr/bin/env bash' to `/gnu/store/ykzwykkvr2c80rw4l1qh3mvfdkl7jibi-bash-4.3.42/bin/bash'
patch-shebang: ./tests/d2/dmd-testsuite/runnable/extra-files/hello-profile-postscript.sh: changing `/usr/bin/env bash' to `/gnu/store/ykzwykkvr2c80rw4l1qh3mvfdkl7jibi-bash-4.3.42/bin/bash'
patch-shebang: ./tests/d2/dmd-testsuite/runnable/extra-files/sieve-postscript.sh: changing `/usr/bin/env bash' to `/gnu/store/ykzwykkvr2c80rw4l1qh3mvfdkl7jibi-bash-4.3.42/bin/bash'
patch-shebang: ./tests/d2/dmd-testsuite/runnable/extra-files/statictor-postscript.sh: changing `/usr/bin/env bash' to `/gnu/store/ykzwykkvr2c80rw4l1qh3mvfdkl7jibi-bash-4.3.42/bin/bash'
patch-shebang: ./tests/d2/dmd-testsuite/runnable/extra-files/testzip-postscript.sh: changing `/usr/bin/env bash' to `/gnu/store/ykzwykkvr2c80rw4l1qh3mvfdkl7jibi-bash-4.3.42/bin/bash'
patch-shebang: ./tests/d2/dmd-testsuite/runnable/link14198a.sh: changing `/usr/bin/env bash' to `/gnu/store/ykzwykkvr2c80rw4l1qh3mvfdkl7jibi-bash-4.3.42/bin/bash'
patch-shebang: ./tests/d2/dmd-testsuite/runnable/link14198b.sh: changing `/usr/bin/env bash' to `/gnu/store/ykzwykkvr2c80rw4l1qh3mvfdkl7jibi-bash-4.3.42/bin/bash'
patch-shebang: ./tests/d2/dmd-testsuite/runnable/link14834.sh: changing `/usr/bin/env bash' to `/gnu/store/ykzwykkvr2c80rw4l1qh3mvfdkl7jibi-bash-4.3.42/bin/bash'
patch-shebang: ./tests/d2/dmd-testsuite/runnable/link846.sh: changing `/usr/bin/env bash' to `/gnu/store/ykzwykkvr2c80rw4l1qh3mvfdkl7jibi-bash-4.3.42/bin/bash'
patch-shebang: ./tests/d2/dmd-testsuite/runnable/linkdebug.sh: changing `/usr/bin/env bash' to `/gnu/store/ykzwykkvr2c80rw4l1qh3mvfdkl7jibi-bash-4.3.42/bin/bash'
patch-shebang: ./tests/d2/dmd-testsuite/runnable/test10386.sh: changing `/usr/bin/env bash' to `/gnu/store/ykzwykkvr2c80rw4l1qh3mvfdkl7jibi-bash-4.3.42/bin/bash'
patch-shebang: ./tests/d2/dmd-testsuite/runnable/test10567.sh: changing `/usr/bin/env bash' to `/gnu/store/ykzwykkvr2c80rw4l1qh3mvfdkl7jibi-bash-4.3.42/bin/bash'
patch-shebang: ./tests/d2/dmd-testsuite/runnable/test13666.sh: changing `/usr/bin/env bash' to `/gnu/store/ykzwykkvr2c80rw4l1qh3mvfdkl7jibi-bash-4.3.42/bin/bash'
patch-shebang: ./tests/d2/dmd-testsuite/runnable/test13774.sh: changing `/usr/bin/env bash' to `/gnu/store/ykzwykkvr2c80rw4l1qh3mvfdkl7jibi-bash-4.3.42/bin/bash'
patch-shebang: ./tests/d2/dmd-testsuite/runnable/test2.sh: changing `/usr/bin/env bash' to `/gnu/store/ykzwykkvr2c80rw4l1qh3mvfdkl7jibi-bash-4.3.42/bin/bash'
patch-shebang: ./tests/d2/dmd-testsuite/runnable/test35.sh: changing `/usr/bin/env bash' to `/gnu/store/ykzwykkvr2c80rw4l1qh3mvfdkl7jibi-bash-4.3.42/bin/bash'
patch-shebang: ./tests/d2/dmd-testsuite/runnable/test39.sh: changing `/usr/bin/env bash' to `/gnu/store/ykzwykkvr2c80rw4l1qh3mvfdkl7jibi-bash-4.3.42/bin/bash'
patch-shebang: ./tests/d2/dmd-testsuite/runnable/test44.sh: changing `/usr/bin/env bash' to `/gnu/store/ykzwykkvr2c80rw4l1qh3mvfdkl7jibi-bash-4.3.42/bin/bash'
patch-shebang: ./tests/d2/dmd-testsuite/runnable/test9377.sh: changing `/usr/bin/env bash' to `/gnu/store/ykzwykkvr2c80rw4l1qh3mvfdkl7jibi-bash-4.3.42/bin/bash'
patch-shebang: ./tests/d2/dmd-testsuite/runnable/test_shared.sh: changing `/usr/bin/env bash' to `/gnu/store/ykzwykkvr2c80rw4l1qh3mvfdkl7jibi-bash-4.3.42/bin/bash'
patch-shebang: ./tests/d2/dmd-testsuite/runnable/untag.d: warning: no binary for interpreter `rdmd' found in $PATH
patch-shebang: ./tests/ir/runlit.py: changing `/usr/bin/env python' to `/gnu/store/wa1yc835mb7pmmrj45xfgviqr5fbasqq-python-wrapper-3.4.3/bin/python'
phase `patch-source-shebangs' succeeded after 0.3 seconds
starting phase `configure'
source directory: "/tmp/guix-build-ldc-0.17.1.drv-0/ldc-0.17.1" (relative from build: "../ldc-0.17.1")
build directory: "/tmp/guix-build-ldc-0.17.1.drv-0/build"
running 'cmake' with arguments ("../ldc-0.17.1" "-DCMAKE_BUILD_TYPE=RelWithDebInfo" "-DCMAKE_INSTALL_PREFIX=/gnu/store/zc31cgq0c1kppxsmvi53cpnrz74m99d1-ldc-0.17.1" "-DCMAKE_INSTALL_RPATH_USE_LINK_PATH=TRUE" "-DCMAKE_INSTALL_RPATH=/gnu/store/zc31cgq0c1kppxsmvi53cpnrz74m99d1-ldc-0.17.1/lib" "-DCMAKE_VERBOSE_MAKEFILE=ON")
-- The C compiler identification is GNU 4.9.3
-- The CXX compiler identification is GNU 4.9.3
-- Check for working C compiler: /gnu/store/frrj3bfbmg5vrd0flh9cf8j64h7cr2v4-gcc-4.9.3/bin/gcc
-- Check for working C compiler: /gnu/store/frrj3bfbmg5vrd0flh9cf8j64h7cr2v4-gcc-4.9.3/bin/gcc -- works
-- Detecting C compiler ABI info
-- Detecting C compiler ABI info - done
-- Detecting C compile features
-- Detecting C compile features - done
-- Check for working CXX compiler: /gnu/store/frrj3bfbmg5vrd0flh9cf8j64h7cr2v4-gcc-4.9.3/bin/c++
-- Check for working CXX compiler: /gnu/store/frrj3bfbmg5vrd0flh9cf8j64h7cr2v4-gcc-4.9.3/bin/c++ -- works
-- Detecting CXX compiler ABI info
-- Detecting CXX compiler ABI info - done
-- Detecting CXX compile features
-- Detecting CXX compile features - done
-- Found LLVM: /gnu/store/2ycqrc4r56r5ww8ja8x4gz25qsp65v65-llvm-3.7.1 (found suitable version "3.7.1", minimum required is "3.5") 
-- Found LibConfig: /gnu/store/1v4anv1dwvskkav1zj08gicwaibachr1-libconfig-1.5/include  
-- The ASM compiler identification is GNU
-- Found assembler: /gnu/store/frrj3bfbmg5vrd0flh9cf8j64h7cr2v4-gcc-4.9.3/bin/gcc
-- LDC version identifier: 0.17.1
-- Check if the system is big endian
-- Searching 16 bit integer
-- Looking for sys/types.h
-- Looking for sys/types.h - found
-- Looking for stdint.h
-- Looking for stdint.h - found
-- Looking for stddef.h
-- Looking for stddef.h - found
-- Check size of unsigned short
-- Check size of unsigned short - done
-- Using unsigned short
-- Check if the system is big endian - little endian
-- Looking for pthread.h
-- Looking for pthread.h - found
-- Looking for pthread_create in pthread
-- Looking for pthread_create in pthread - found
-- Looking for setupterm in tinfo
-- Looking for setupterm in tinfo - not found
-- Looking for setupterm in terminfo
-- Looking for setupterm in terminfo - not found
-- Looking for setupterm in curses
-- Looking for setupterm in curses - not found
-- Looking for setupterm in ncurses
-- Looking for setupterm in ncurses - not found
-- Looking for setupterm in ncursesw
-- Looking for setupterm in ncursesw - not found
-- Using path for Intrinsics.td: /gnu/store/2ycqrc4r56r5ww8ja8x4gz25qsp65v65-llvm-3.7.1/include
-- Looking for _SC_ARG_MAX
-- Looking for _SC_ARG_MAX - found
-- Check size of void*
-- Check size of void* - done
-- Configuring done
-- Generating done
-- Build files have been written to: /tmp/guix-build-ldc-0.17.1.drv-0/build
phase `configure' succeeded after 6.8 seconds
starting phase `patch-generated-file-shebangs'
phase `patch-generated-file-shebangs' succeeded after 0.1 seconds
starting phase `build'
/gnu/store/zcn7lm8lf60q0756q7z9qpvl9z5wbh82-cmake-3.5.2/bin/cmake -H/tmp/guix-build-ldc-0.17.1.drv-0/ldc-0.17.1 -B/tmp/guix-build-ldc-0.17.1.drv-0/build --check-build-system CMakeFiles/Makefile.cmake 0
/gnu/store/zcn7lm8lf60q0756q7z9qpvl9z5wbh82-cmake-3.5.2/bin/cmake -E cmake_progress_start /tmp/guix-build-ldc-0.17.1.drv-0/build/CMakeFiles /tmp/guix-build-ldc-0.17.1.drv-0/build/CMakeFiles/progress.marks
make -f CMakeFiles/Makefile2 all
make[1]: Entering directory '/tmp/guix-build-ldc-0.17.1.drv-0/build'
make -f CMakeFiles/idgen.dir/build.make CMakeFiles/idgen.dir/depend
make -f CMakeFiles/impcnvgen.dir/build.make CMakeFiles/impcnvgen.dir/depend
make -f CMakeFiles/FileCheck.dir/build.make CMakeFiles/FileCheck.dir/depend
make -f CMakeFiles/gen_gccbuiltins.dir/build.make CMakeFiles/gen_gccbuiltins.dir/depend
make[2]: Entering directory '/tmp/guix-build-ldc-0.17.1.drv-0/build'
make[2]: Entering directory '/tmp/guix-build-ldc-0.17.1.drv-0/build'
cd /tmp/guix-build-ldc-0.17.1.drv-0/build && /gnu/store/zcn7lm8lf60q0756q7z9qpvl9z5wbh82-cmake-3.5.2/bin/cmake -E cmake_depends "Unix Makefiles" /tmp/guix-build-ldc-0.17.1.drv-0/ldc-0.17.1 /tmp/guix-build-ldc-0.17.1.drv-0/ldc-0.17.1 /tmp/guix-build-ldc-0.17.1.drv-0/build /tmp/guix-build-ldc-0.17.1.drv-0/build /tmp/guix-build-ldc-0.17.1.drv-0/build/CMakeFiles/FileCheck.dir/DependInfo.cmake --color=
make[2]: Entering directory '/tmp/guix-build-ldc-0.17.1.drv-0/build'
cd /tmp/guix-build-ldc-0.17.1.drv-0/build && /gnu/store/zcn7lm8lf60q0756q7z9qpvl9z5wbh82-cmake-3.5.2/bin/cmake -E cmake_depends "Unix Makefiles" /tmp/guix-build-ldc-0.17.1.drv-0/ldc-0.17.1 /tmp/guix-build-ldc-0.17.1.drv-0/ldc-0.17.1 /tmp/guix-build-ldc-0.17.1.drv-0/build /tmp/guix-build-ldc-0.17.1.drv-0/build /tmp/guix-build-ldc-0.17.1.drv-0/build/CMakeFiles/gen_gccbuiltins.dir/DependInfo.cmake --color=
make[2]: Entering directory '/tmp/guix-build-ldc-0.17.1.drv-0/build'
cd /tmp/guix-build-ldc-0.17.1.drv-0/build && /gnu/store/zcn7lm8lf60q0756q7z9qpvl9z5wbh82-cmake-3.5.2/bin/cmake -E cmake_depends "Unix Makefiles" /tmp/guix-build-ldc-0.17.1.drv-0/ldc-0.17.1 /tmp/guix-build-ldc-0.17.1.drv-0/ldc-0.17.1 /tmp/guix-build-ldc-0.17.1.drv-0/build /tmp/guix-build-ldc-0.17.1.drv-0/build /tmp/guix-build-ldc-0.17.1.drv-0/build/CMakeFiles/impcnvgen.dir/DependInfo.cmake --color=
cd /tmp/guix-build-ldc-0.17.1.drv-0/build && /gnu/store/zcn7lm8lf60q0756q7z9qpvl9z5wbh82-cmake-3.5.2/bin/cmake -E cmake_depends "Unix Makefiles" /tmp/guix-build-ldc-0.17.1.drv-0/ldc-0.17.1 /tmp/guix-build-ldc-0.17.1.drv-0/ldc-0.17.1 /tmp/guix-build-ldc-0.17.1.drv-0/build /tmp/guix-build-ldc-0.17.1.drv-0/build /tmp/guix-build-ldc-0.17.1.drv-0/build/CMakeFiles/idgen.dir/DependInfo.cmake --color=
Scanning dependencies of target idgen
make[2]: Leaving directory '/tmp/guix-build-ldc-0.17.1.drv-0/build'
make -f CMakeFiles/idgen.dir/build.make CMakeFiles/idgen.dir/build
Scanning dependencies of target impcnvgen
make[2]: Leaving directory '/tmp/guix-build-ldc-0.17.1.drv-0/build'
make -f CMakeFiles/impcnvgen.dir/build.make CMakeFiles/impcnvgen.dir/build
Scanning dependencies of target gen_gccbuiltins
make[2]: Leaving directory '/tmp/guix-build-ldc-0.17.1.drv-0/build'
make -f CMakeFiles/gen_gccbuiltins.dir/build.make CMakeFiles/gen_gccbuiltins.dir/build
make[2]: Entering directory '/tmp/guix-build-ldc-0.17.1.drv-0/build'
Scanning dependencies of target FileCheck
make[2]: Leaving directory '/tmp/guix-build-ldc-0.17.1.drv-0/build'
make -f CMakeFiles/FileCheck.dir/build.make CMakeFiles/FileCheck.dir/build
make[2]: Entering directory '/tmp/guix-build-ldc-0.17.1.drv-0/build'
make[2]: Entering directory '/tmp/guix-build-ldc-0.17.1.drv-0/build'
make[2]: Entering directory '/tmp/guix-build-ldc-0.17.1.drv-0/build'
[  0%] Building CXX object CMakeFiles/idgen.dir/dmd2/idgen.c.o
/gnu/store/frrj3bfbmg5vrd0flh9cf8j64h7cr2v4-gcc-4.9.3/bin/c++   -DDMDV2 -DHAVE_SC_ARG_MAX -DIN_LLVM -DLDC_INSTALL_PREFIX=\"/gnu/store/zc31cgq0c1kppxsmvi53cpnrz74m99d1-ldc-0.17.1\" -DLDC_LLVM_VER=307 -DLLVM_INTRINSIC_TD_PATH=\"/gnu/store/2ycqrc4r56r5ww8ja8x4gz25qsp65v65-llvm-3.7.1/include\" -DOPAQUE_VTBLS -D__LITTLE_ENDIAN__ -I/tmp/guix-build-ldc-0.17.1.drv-0/ldc-0.17.1/. -I/tmp/guix-build-ldc-0.17.1.drv-0/ldc-0.17.1/dmd2 -I/tmp/guix-build-ldc-0.17.1.drv-0/ldc-0.17.1/dmd2/root -I/tmp/guix-build-ldc-0.17.1.drv-0/build/dmd2 -I/tmp/guix-build-ldc-0.17.1.drv-0/ldc-0.17.1 -isystem /gnu/store/2ycqrc4r56r5ww8ja8x4gz25qsp65v65-llvm-3.7.1/include -isystem /gnu/store/1v4anv1dwvskkav1zj08gicwaibachr1-libconfig-1.5/include  -O2 -g -DNDEBUG   -I/gnu/store/2ycqrc4r56r5ww8ja8x4gz25qsp65v65-llvm-3.7.1/include  -fPIC -fvisibility-inlines-hidden -Wall -W -Wno-unused-parameter -Wwrite-strings -Wcast-qual -Wno-missing-field-initializers -pedantic -Wno-long-long -Wno-maybe-uninitialized -Wno-comment -std=c++11 -ffunction-sections -fdata-sections -O3 -DNDEBUG -fno-exceptions -fno-rtti  -D_GNU_SOURCE -D__STDC_CONSTANT_MACROS -D__STDC_FORMAT_MACROS -D__STDC_LIMIT_MACROS  -w -DPOSIX -DLDC_POSIX  -o CMakeFiles/idgen.dir/dmd2/idgen.c.o -c /tmp/guix-build-ldc-0.17.1.drv-0/ldc-0.17.1/dmd2/idgen.c
[  0%] Building CXX object CMakeFiles/impcnvgen.dir/dmd2/impcnvgen.c.o
[  0%] Building CXX object CMakeFiles/gen_gccbuiltins.dir/utils/gen_gccbuiltins.cpp.o
/gnu/store/frrj3bfbmg5vrd0flh9cf8j64h7cr2v4-gcc-4.9.3/bin/c++   -DDMDV2 -DHAVE_SC_ARG_MAX -DIN_LLVM -DLDC_INSTALL_PREFIX=\"/gnu/store/zc31cgq0c1kppxsmvi53cpnrz74m99d1-ldc-0.17.1\" -DLDC_LLVM_VER=307 -DLLVM_INTRINSIC_TD_PATH=\"/gnu/store/2ycqrc4r56r5ww8ja8x4gz25qsp65v65-llvm-3.7.1/include\" -DOPAQUE_VTBLS -D__LITTLE_ENDIAN__ -I/tmp/guix-build-ldc-0.17.1.drv-0/ldc-0.17.1/. -I/tmp/guix-build-ldc-0.17.1.drv-0/ldc-0.17.1/dmd2 -I/tmp/guix-build-ldc-0.17.1.drv-0/ldc-0.17.1/dmd2/root -I/tmp/guix-build-ldc-0.17.1.drv-0/build/dmd2 -I/tmp/guix-build-ldc-0.17.1.drv-0/ldc-0.17.1 -isystem /gnu/store/2ycqrc4r56r5ww8ja8x4gz25qsp65v65-llvm-3.7.1/include -isystem /gnu/store/1v4anv1dwvskkav1zj08gicwaibachr1-libconfig-1.5/include  -O2 -g -DNDEBUG   -I/gnu/store/2ycqrc4r56r5ww8ja8x4gz25qsp65v65-llvm-3.7.1/include  -fPIC -fvisibility-inlines-hidden -Wall -W -Wno-unused-parameter -Wwrite-strings -Wcast-qual -Wno-missing-field-initializers -pedantic -Wno-long-long -Wno-maybe-uninitialized -Wno-comment -std=c++11 -ffunction-sections -fdata-sections -O3 -DNDEBUG -fno-exceptions -fno-rtti  -D_GNU_SOURCE -D__STDC_CONSTANT_MACROS -D__STDC_FORMAT_MACROS -D__STDC_LIMIT_MACROS  -w -DPOSIX -DLDC_POSIX  -o CMakeFiles/impcnvgen.dir/dmd2/impcnvgen.c.o -c /tmp/guix-build-ldc-0.17.1.drv-0/ldc-0.17.1/dmd2/impcnvgen.c
/gnu/store/frrj3bfbmg5vrd0flh9cf8j64h7cr2v4-gcc-4.9.3/bin/c++   -DDMDV2 -DHAVE_SC_ARG_MAX -DIN_LLVM -DLDC_INSTALL_PREFIX=\"/gnu/store/zc31cgq0c1kppxsmvi53cpnrz74m99d1-ldc-0.17.1\" -DLDC_LLVM_VER=307 -DLLVM_INTRINSIC_TD_PATH=\"/gnu/store/2ycqrc4r56r5ww8ja8x4gz25qsp65v65-llvm-3.7.1/include\" -DOPAQUE_VTBLS -D__LITTLE_ENDIAN__ -I/tmp/guix-build-ldc-0.17.1.drv-0/ldc-0.17.1/. -I/tmp/guix-build-ldc-0.17.1.drv-0/ldc-0.17.1/dmd2 -I/tmp/guix-build-ldc-0.17.1.drv-0/ldc-0.17.1/dmd2/root -I/tmp/guix-build-ldc-0.17.1.drv-0/build/dmd2 -I/tmp/guix-build-ldc-0.17.1.drv-0/ldc-0.17.1 -isystem /gnu/store/2ycqrc4r56r5ww8ja8x4gz25qsp65v65-llvm-3.7.1/include -isystem /gnu/store/1v4anv1dwvskkav1zj08gicwaibachr1-libconfig-1.5/include  -O2 -g -DNDEBUG   -I/gnu/store/2ycqrc4r56r5ww8ja8x4gz25qsp65v65-llvm-3.7.1/include  -fPIC -fvisibility-inlines-hidden -Wall -W -Wno-unused-parameter -Wwrite-strings -Wcast-qual -Wno-missing-field-initializers -pedantic -Wno-long-long -Wno-maybe-uninitialized -Wno-comment -std=c++11 -ffunction-sections -fdata-sections -O3 -DNDEBUG -fno-exceptions -fno-rtti  -D_GNU_SOURCE -D__STDC_CONSTANT_MACROS -D__STDC_FORMAT_MACROS -D__STDC_LIMIT_MACROS  -Wall -Wextra -Wno-unused-parameter -Wno-missing-field-initializers -Wno-non-virtual-dtor -Wno-pedantic -DLDC_POSIX  -o CMakeFiles/gen_gccbuiltins.dir/utils/gen_gccbuiltins.cpp.o -c /tmp/guix-build-ldc-0.17.1.drv-0/ldc-0.17.1/utils/gen_gccbuiltins.cpp
[  0%] Building CXX object CMakeFiles/FileCheck.dir/utils/FileCheck-3.7.cpp.o
/gnu/store/frrj3bfbmg5vrd0flh9cf8j64h7cr2v4-gcc-4.9.3/bin/c++   -DDMDV2 -DHAVE_SC_ARG_MAX -DIN_LLVM -DLDC_INSTALL_PREFIX=\"/gnu/store/zc31cgq0c1kppxsmvi53cpnrz74m99d1-ldc-0.17.1\" -DLDC_LLVM_VER=307 -DLLVM_INTRINSIC_TD_PATH=\"/gnu/store/2ycqrc4r56r5ww8ja8x4gz25qsp65v65-llvm-3.7.1/include\" -DOPAQUE_VTBLS -D__LITTLE_ENDIAN__ -I/tmp/guix-build-ldc-0.17.1.drv-0/ldc-0.17.1/. -I/tmp/guix-build-ldc-0.17.1.drv-0/ldc-0.17.1/dmd2 -I/tmp/guix-build-ldc-0.17.1.drv-0/ldc-0.17.1/dmd2/root -I/tmp/guix-build-ldc-0.17.1.drv-0/build/dmd2 -I/tmp/guix-build-ldc-0.17.1.drv-0/ldc-0.17.1 -isystem /gnu/store/2ycqrc4r56r5ww8ja8x4gz25qsp65v65-llvm-3.7.1/include -isystem /gnu/store/1v4anv1dwvskkav1zj08gicwaibachr1-libconfig-1.5/include  -O2 -g -DNDEBUG   -I/gnu/store/2ycqrc4r56r5ww8ja8x4gz25qsp65v65-llvm-3.7.1/include  -fPIC -fvisibility-inlines-hidden -Wall -W -Wno-unused-parameter -Wwrite-strings -Wcast-qual -Wno-missing-field-initializers -pedantic -Wno-long-long -Wno-maybe-uninitialized -Wno-comment -std=c++11 -ffunction-sections -fdata-sections -O3 -DNDEBUG -fno-exceptions -fno-rtti  -D_GNU_SOURCE -D__STDC_CONSTANT_MACROS -D__STDC_FORMAT_MACROS -D__STDC_LIMIT_MACROS  -Wall -Wextra -Wno-unused-parameter -Wno-missing-field-initializers -Wno-non-virtual-dtor -Wno-pedantic -DLDC_POSIX  -o CMakeFiles/FileCheck.dir/utils/FileCheck-3.7.cpp.o -c /tmp/guix-build-ldc-0.17.1.drv-0/ldc-0.17.1/utils/FileCheck-3.7.cpp
[  0%] Linking CXX executable dmd2/idgen
/gnu/store/zcn7lm8lf60q0756q7z9qpvl9z5wbh82-cmake-3.5.2/bin/cmake -E cmake_link_script CMakeFiles/idgen.dir/link.txt --verbose=1
/gnu/store/frrj3bfbmg5vrd0flh9cf8j64h7cr2v4-gcc-4.9.3/bin/c++   -O2 -g -DNDEBUG   CMakeFiles/idgen.dir/dmd2/idgen.c.o  -o dmd2/idgen -rdynamic 
make[2]: Leaving directory '/tmp/guix-build-ldc-0.17.1.drv-0/build'
[  0%] Built target idgen
make -f CMakeFiles/not.dir/build.make CMakeFiles/not.dir/depend
make[2]: Entering directory '/tmp/guix-build-ldc-0.17.1.drv-0/build'
cd /tmp/guix-build-ldc-0.17.1.drv-0/build && /gnu/store/zcn7lm8lf60q0756q7z9qpvl9z5wbh82-cmake-3.5.2/bin/cmake -E cmake_depends "Unix Makefiles" /tmp/guix-build-ldc-0.17.1.drv-0/ldc-0.17.1 /tmp/guix-build-ldc-0.17.1.drv-0/ldc-0.17.1 /tmp/guix-build-ldc-0.17.1.drv-0/build /tmp/guix-build-ldc-0.17.1.drv-0/build /tmp/guix-build-ldc-0.17.1.drv-0/build/CMakeFiles/not.dir/DependInfo.cmake --color=
Scanning dependencies of target not
make[2]: Leaving directory '/tmp/guix-build-ldc-0.17.1.drv-0/build'
make -f CMakeFiles/not.dir/build.make CMakeFiles/not.dir/build
make[2]: Entering directory '/tmp/guix-build-ldc-0.17.1.drv-0/build'
[  0%] Building CXX object CMakeFiles/not.dir/utils/not.cpp.o
/gnu/store/frrj3bfbmg5vrd0flh9cf8j64h7cr2v4-gcc-4.9.3/bin/c++   -DDMDV2 -DHAVE_SC_ARG_MAX -DIN_LLVM -DLDC_INSTALL_PREFIX=\"/gnu/store/zc31cgq0c1kppxsmvi53cpnrz74m99d1-ldc-0.17.1\" -DLDC_LLVM_VER=307 -DLLVM_INTRINSIC_TD_PATH=\"/gnu/store/2ycqrc4r56r5ww8ja8x4gz25qsp65v65-llvm-3.7.1/include\" -DOPAQUE_VTBLS -D__LITTLE_ENDIAN__ -I/tmp/guix-build-ldc-0.17.1.drv-0/ldc-0.17.1/. -I/tmp/guix-build-ldc-0.17.1.drv-0/ldc-0.17.1/dmd2 -I/tmp/guix-build-ldc-0.17.1.drv-0/ldc-0.17.1/dmd2/root -I/tmp/guix-build-ldc-0.17.1.drv-0/build/dmd2 -I/tmp/guix-build-ldc-0.17.1.drv-0/ldc-0.17.1 -isystem /gnu/store/2ycqrc4r56r5ww8ja8x4gz25qsp65v65-llvm-3.7.1/include -isystem /gnu/store/1v4anv1dwvskkav1zj08gicwaibachr1-libconfig-1.5/include  -O2 -g -DNDEBUG   -I/gnu/store/2ycqrc4r56r5ww8ja8x4gz25qsp65v65-llvm-3.7.1/include  -fPIC -fvisibility-inlines-hidden -Wall -W -Wno-unused-parameter -Wwrite-strings -Wcast-qual -Wno-missing-field-initializers -pedantic -Wno-long-long -Wno-maybe-uninitialized -Wno-comment -std=c++11 -ffunction-sections -fdata-sections -O3 -DNDEBUG -fno-exceptions -fno-rtti  -D_GNU_SOURCE -D__STDC_CONSTANT_MACROS -D__STDC_FORMAT_MACROS -D__STDC_LIMIT_MACROS  -Wall -Wextra -Wno-unused-parameter -Wno-missing-field-initializers -Wno-non-virtual-dtor -Wno-pedantic -DLDC_POSIX  -o CMakeFiles/not.dir/utils/not.cpp.o -c /tmp/guix-build-ldc-0.17.1.drv-0/ldc-0.17.1/utils/not.cpp
[  0%] Linking CXX executable bin/not
/gnu/store/zcn7lm8lf60q0756q7z9qpvl9z5wbh82-cmake-3.5.2/bin/cmake -E cmake_link_script CMakeFiles/not.dir/link.txt --verbose=1
/gnu/store/frrj3bfbmg5vrd0flh9cf8j64h7cr2v4-gcc-4.9.3/bin/c++   -O2 -g -DNDEBUG   CMakeFiles/not.dir/utils/not.cpp.o  -o bin/not -rdynamic -lLLVMOption -lLLVMLTO -lLLVMObjCARCOpts -lLLVMLinker -lLLVMIRReader -lLLVMDebugInfoPDB -lLLVMDebugInfoDWARF -lLLVMBitWriter -lLLVMAsmParser -lLLVMXCoreDisassembler -lLLVMXCoreCodeGen -lLLVMXCoreDesc -lLLVMXCoreInfo -lLLVMXCoreAsmPrinter -lLLVMX86Disassembler -lLLVMX86AsmParser -lLLVMX86CodeGen -lLLVMX86Desc -lLLVMX86Info -lLLVMX86AsmPrinter -lLLVMX86Utils -lLLVMSystemZDisassembler -lLLVMSystemZCodeGen -lLLVMSystemZAsmParser -lLLVMSystemZDesc -lLLVMSystemZInfo -lLLVMSystemZAsmPrinter -lLLVMSparcDisassembler -lLLVMSparcCodeGen -lLLVMSparcAsmParser -lLLVMSparcDesc -lLLVMSparcInfo -lLLVMSparcAsmPrinter -lLLVMPowerPCDisassembler -lLLVMPowerPCCodeGen -lLLVMPowerPCAsmParser -lLLVMPowerPCDesc -lLLVMPowerPCInfo -lLLVMPowerPCAsmPrinter -lLLVMNVPTXCodeGen -lLLVMNVPTXDesc -lLLVMNVPTXInfo -lLLVMNVPTXAsmPrinter -lLLVMMSP430CodeGen -lLLVMMSP430Desc -lLLVMMSP430Info -lLLVMMSP430AsmPrinter -lLLVMMipsDisassembler -lLLVMMipsCodeGen -lLLVMMipsAsmParser -lLLVMMipsDesc -lLLVMMipsInfo -lLLVMMipsAsmPrinter -lLLVMHexagonDisassembler -lLLVMHexagonCodeGen -lLLVMHexagonDesc -lLLVMHexagonInfo -lLLVMCppBackendCodeGen -lLLVMCppBackendInfo -lLLVMBPFCodeGen -lLLVMBPFDesc -lLLVMBPFInfo -lLLVMBPFAsmPrinter -lLLVMARMDisassembler -lLLVMARMCodeGen -lLLVMARMAsmParser -lLLVMARMDesc -lLLVMARMInfo -lLLVMARMAsmPrinter -lLLVMAMDGPUCodeGen -lLLVMipo -lLLVMVectorize -lLLVMAMDGPUAsmParser -lLLVMAMDGPUUtils -lLLVMAMDGPUDesc -lLLVMAMDGPUInfo -lLLVMAMDGPUAsmPrinter -lLLVMAArch64Disassembler -lLLVMMCDisassembler -lLLVMAArch64CodeGen -lLLVMSelectionDAG -lLLVMAsmPrinter -lLLVMCodeGen -lLLVMTarget -lLLVMScalarOpts -lLLVMProfileData -lLLVMObject -lLLVMBitReader -lLLVMInstCombine -lLLVMInstrumentation -lLLVMTransformUtils -lLLVMipa -lLLVMAnalysis -lLLVMCore -lLLVMAArch64AsmParser -lLLVMMCParser -lLLVMAArch64Desc -lLLVMAArch64Info -lLLVMAArch64AsmPrinter -lLLVMMC -lLLVMAArch64Utils -lLLVMSupport -ldl -L/gnu/store/2ycqrc4r56r5ww8ja8x4gz25qsp65v65-llvm-3.7.1/lib -lrt -ldl -lpthread -lz -lm 
make[2]: Leaving directory '/tmp/guix-build-ldc-0.17.1.drv-0/build'
[  0%] Built target not
make -f CMakeFiles/ldmd2.dir/build.make CMakeFiles/ldmd2.dir/depend
make[2]: Entering directory '/tmp/guix-build-ldc-0.17.1.drv-0/build'
cd /tmp/guix-build-ldc-0.17.1.drv-0/build && /gnu/store/zcn7lm8lf60q0756q7z9qpvl9z5wbh82-cmake-3.5.2/bin/cmake -E cmake_depends "Unix Makefiles" /tmp/guix-build-ldc-0.17.1.drv-0/ldc-0.17.1 /tmp/guix-build-ldc-0.17.1.drv-0/ldc-0.17.1 /tmp/guix-build-ldc-0.17.1.drv-0/build /tmp/guix-build-ldc-0.17.1.drv-0/build /tmp/guix-build-ldc-0.17.1.drv-0/build/CMakeFiles/ldmd2.dir/DependInfo.cmake --color=
Scanning dependencies of target ldmd2
make[2]: Leaving directory '/tmp/guix-build-ldc-0.17.1.drv-0/build'
make -f CMakeFiles/ldmd2.dir/build.make CMakeFiles/ldmd2.dir/build
make[2]: Entering directory '/tmp/guix-build-ldc-0.17.1.drv-0/build'
[  0%] Building CXX object CMakeFiles/ldmd2.dir/dmd2/root/man.c.o
/gnu/store/frrj3bfbmg5vrd0flh9cf8j64h7cr2v4-gcc-4.9.3/bin/c++   -DDMDV2 -DHAVE_SC_ARG_MAX -DIN_LLVM -DLDC_EXE_NAME=\"ldc2\" -DLDC_INSTALL_PREFIX=\"/gnu/store/zc31cgq0c1kppxsmvi53cpnrz74m99d1-ldc-0.17.1\" -DLDC_LLVM_VER=307 -DLLVM_INTRINSIC_TD_PATH=\"/gnu/store/2ycqrc4r56r5ww8ja8x4gz25qsp65v65-llvm-3.7.1/include\" -DOPAQUE_VTBLS -D__LITTLE_ENDIAN__ -I/tmp/guix-build-ldc-0.17.1.drv-0/ldc-0.17.1/. -I/tmp/guix-build-ldc-0.17.1.drv-0/ldc-0.17.1/dmd2 -I/tmp/guix-build-ldc-0.17.1.drv-0/ldc-0.17.1/dmd2/root -I/tmp/guix-build-ldc-0.17.1.drv-0/build/dmd2 -I/tmp/guix-build-ldc-0.17.1.drv-0/ldc-0.17.1 -isystem /gnu/store/2ycqrc4r56r5ww8ja8x4gz25qsp65v65-llvm-3.7.1/include -isystem /gnu/store/1v4anv1dwvskkav1zj08gicwaibachr1-libconfig-1.5/include  -O2 -g -DNDEBUG   -I/gnu/store/2ycqrc4r56r5ww8ja8x4gz25qsp65v65-llvm-3.7.1/include  -fPIC -fvisibility-inlines-hidden -Wall -W -Wno-unused-parameter -Wwrite-strings -Wcast-qual -Wno-missing-field-initializers -pedantic -Wno-long-long -Wno-maybe-uninitialized -Wno-comment -std=c++11 -ffunction-sections -fdata-sections -O3 -DNDEBUG -fno-exceptions -fno-rtti  -D_GNU_SOURCE -D__STDC_CONSTANT_MACROS -D__STDC_FORMAT_MACROS -D__STDC_LIMIT_MACROS  -w -DPOSIX -DLDC_POSIX  -o CMakeFiles/ldmd2.dir/dmd2/root/man.c.o -c /tmp/guix-build-ldc-0.17.1.drv-0/ldc-0.17.1/dmd2/root/man.c
[  0%] Building CXX object CMakeFiles/ldmd2.dir/driver/exe_path.cpp.o
/gnu/store/frrj3bfbmg5vrd0flh9cf8j64h7cr2v4-gcc-4.9.3/bin/c++   -DDMDV2 -DHAVE_SC_ARG_MAX -DIN_LLVM -DLDC_EXE_NAME=\"ldc2\" -DLDC_INSTALL_PREFIX=\"/gnu/store/zc31cgq0c1kppxsmvi53cpnrz74m99d1-ldc-0.17.1\" -DLDC_LLVM_VER=307 -DLLVM_INTRINSIC_TD_PATH=\"/gnu/store/2ycqrc4r56r5ww8ja8x4gz25qsp65v65-llvm-3.7.1/include\" -DOPAQUE_VTBLS -D__LITTLE_ENDIAN__ -I/tmp/guix-build-ldc-0.17.1.drv-0/ldc-0.17.1/. -I/tmp/guix-build-ldc-0.17.1.drv-0/ldc-0.17.1/dmd2 -I/tmp/guix-build-ldc-0.17.1.drv-0/ldc-0.17.1/dmd2/root -I/tmp/guix-build-ldc-0.17.1.drv-0/build/dmd2 -I/tmp/guix-build-ldc-0.17.1.drv-0/ldc-0.17.1 -isystem /gnu/store/2ycqrc4r56r5ww8ja8x4gz25qsp65v65-llvm-3.7.1/include -isystem /gnu/store/1v4anv1dwvskkav1zj08gicwaibachr1-libconfig-1.5/include  -O2 -g -DNDEBUG   -I/gnu/store/2ycqrc4r56r5ww8ja8x4gz25qsp65v65-llvm-3.7.1/include  -fPIC -fvisibility-inlines-hidden -Wall -W -Wno-unused-parameter -Wwrite-strings -Wcast-qual -Wno-missing-field-initializers -pedantic -Wno-long-long -Wno-maybe-uninitialized -Wno-comment -std=c++11 -ffunction-sections -fdata-sections -O3 -DNDEBUG -fno-exceptions -fno-rtti  -D_GNU_SOURCE -D__STDC_CONSTANT_MACROS -D__STDC_FORMAT_MACROS -D__STDC_LIMIT_MACROS  -Wall -Wextra -Wno-unused-parameter -Wno-missing-field-initializers -Wno-non-virtual-dtor -Wno-pedantic -DLDC_POSIX  -o CMakeFiles/ldmd2.dir/driver/exe_path.cpp.o -c /tmp/guix-build-ldc-0.17.1.drv-0/ldc-0.17.1/driver/exe_path.cpp
[  0%] Linking CXX executable bin/gen_gccbuiltins
/gnu/store/zcn7lm8lf60q0756q7z9qpvl9z5wbh82-cmake-3.5.2/bin/cmake -E cmake_link_script CMakeFiles/gen_gccbuiltins.dir/link.txt --verbose=1
/gnu/store/frrj3bfbmg5vrd0flh9cf8j64h7cr2v4-gcc-4.9.3/bin/c++   -O2 -g -DNDEBUG   CMakeFiles/gen_gccbuiltins.dir/utils/gen_gccbuiltins.cpp.o  -o bin/gen_gccbuiltins -rdynamic -lLLVMTableGen -lLLVMOption -lLLVMLTO -lLLVMObjCARCOpts -lLLVMLinker -lLLVMIRReader -lLLVMDebugInfoPDB -lLLVMDebugInfoDWARF -lLLVMBitWriter -lLLVMAsmParser -lLLVMXCoreDisassembler -lLLVMXCoreCodeGen -lLLVMXCoreDesc -lLLVMXCoreInfo -lLLVMXCoreAsmPrinter -lLLVMX86Disassembler -lLLVMX86AsmParser -lLLVMX86CodeGen -lLLVMX86Desc -lLLVMX86Info -lLLVMX86AsmPrinter -lLLVMX86Utils -lLLVMSystemZDisassembler -lLLVMSystemZCodeGen -lLLVMSystemZAsmParser -lLLVMSystemZDesc -lLLVMSystemZInfo -lLLVMSystemZAsmPrinter -lLLVMSparcDisassembler -lLLVMSparcCodeGen -lLLVMSparcAsmParser -lLLVMSparcDesc -lLLVMSparcInfo -lLLVMSparcAsmPrinter -lLLVMPowerPCDisassembler -lLLVMPowerPCCodeGen -lLLVMPowerPCAsmParser -lLLVMPowerPCDesc -lLLVMPowerPCInfo -lLLVMPowerPCAsmPrinter -lLLVMNVPTXCodeGen -lLLVMNVPTXDesc -lLLVMNVPTXInfo -lLLVMNVPTXAsmPrinter -lLLVMMSP430CodeGen -lLLVMMSP430Desc -lLLVMMSP430Info -lLLVMMSP430AsmPrinter -lLLVMMipsDisassembler -lLLVMMipsCodeGen -lLLVMMipsAsmParser -lLLVMMipsDesc -lLLVMMipsInfo -lLLVMMipsAsmPrinter -lLLVMHexagonDisassembler -lLLVMHexagonCodeGen -lLLVMHexagonDesc -lLLVMHexagonInfo -lLLVMCppBackendCodeGen -lLLVMCppBackendInfo -lLLVMBPFCodeGen -lLLVMBPFDesc -lLLVMBPFInfo -lLLVMBPFAsmPrinter -lLLVMARMDisassembler -lLLVMARMCodeGen -lLLVMARMAsmParser -lLLVMARMDesc -lLLVMARMInfo -lLLVMARMAsmPrinter -lLLVMAMDGPUCodeGen -lLLVMipo -lLLVMVectorize -lLLVMAMDGPUAsmParser -lLLVMAMDGPUUtils -lLLVMAMDGPUDesc -lLLVMAMDGPUInfo -lLLVMAMDGPUAsmPrinter -lLLVMAArch64Disassembler -lLLVMMCDisassembler -lLLVMAArch64CodeGen -lLLVMSelectionDAG -lLLVMAsmPrinter -lLLVMCodeGen -lLLVMTarget -lLLVMScalarOpts -lLLVMProfileData -lLLVMObject -lLLVMBitReader -lLLVMInstCombine -lLLVMInstrumentation -lLLVMTransformUtils -lLLVMipa -lLLVMAnalysis -lLLVMCore -lLLVMAArch64AsmParser -lLLVMMCParser -lLLVMAArch64Desc -lLLVMAArch64Info -lLLVMAArch64AsmPrinter -lLLVMMC -lLLVMAArch64Utils -lLLVMSupport -lpthread -ldl -L/gnu/store/2ycqrc4r56r5ww8ja8x4gz25qsp65v65-llvm-3.7.1/lib -lrt -ldl -lpthread -lz -lm -ldl 
[  1%] Linking CXX executable dmd2/impcnvgen
/gnu/store/zcn7lm8lf60q0756q7z9qpvl9z5wbh82-cmake-3.5.2/bin/cmake -E cmake_link_script CMakeFiles/impcnvgen.dir/link.txt --verbose=1
/gnu/store/frrj3bfbmg5vrd0flh9cf8j64h7cr2v4-gcc-4.9.3/bin/c++   -O2 -g -DNDEBUG   CMakeFiles/impcnvgen.dir/dmd2/impcnvgen.c.o  -o dmd2/impcnvgen -rdynamic 
make[2]: Leaving directory '/tmp/guix-build-ldc-0.17.1.drv-0/build'
[  1%] Built target impcnvgen
[  1%] Building CXX object CMakeFiles/ldmd2.dir/driver/ldmd.cpp.o
/gnu/store/frrj3bfbmg5vrd0flh9cf8j64h7cr2v4-gcc-4.9.3/bin/c++   -DDMDV2 -DHAVE_SC_ARG_MAX -DIN_LLVM -DLDC_EXE_NAME=\"ldc2\" -DLDC_INSTALL_PREFIX=\"/gnu/store/zc31cgq0c1kppxsmvi53cpnrz74m99d1-ldc-0.17.1\" -DLDC_LLVM_VER=307 -DLLVM_INTRINSIC_TD_PATH=\"/gnu/store/2ycqrc4r56r5ww8ja8x4gz25qsp65v65-llvm-3.7.1/include\" -DOPAQUE_VTBLS -D__LITTLE_ENDIAN__ -I/tmp/guix-build-ldc-0.17.1.drv-0/ldc-0.17.1/. -I/tmp/guix-build-ldc-0.17.1.drv-0/ldc-0.17.1/dmd2 -I/tmp/guix-build-ldc-0.17.1.drv-0/ldc-0.17.1/dmd2/root -I/tmp/guix-build-ldc-0.17.1.drv-0/build/dmd2 -I/tmp/guix-build-ldc-0.17.1.drv-0/ldc-0.17.1 -isystem /gnu/store/2ycqrc4r56r5ww8ja8x4gz25qsp65v65-llvm-3.7.1/include -isystem /gnu/store/1v4anv1dwvskkav1zj08gicwaibachr1-libconfig-1.5/include  -O2 -g -DNDEBUG   -I/gnu/store/2ycqrc4r56r5ww8ja8x4gz25qsp65v65-llvm-3.7.1/include  -fPIC -fvisibility-inlines-hidden -Wall -W -Wno-unused-parameter -Wwrite-strings -Wcast-qual -Wno-missing-field-initializers -pedantic -Wno-long-long -Wno-maybe-uninitialized -Wno-comment -std=c++11 -ffunction-sections -fdata-sections -O3 -DNDEBUG -fno-exceptions -fno-rtti  -D_GNU_SOURCE -D__STDC_CONSTANT_MACROS -D__STDC_FORMAT_MACROS -D__STDC_LIMIT_MACROS  -Wall -Wextra -Wno-unused-parameter -Wno-missing-field-initializers -Wno-non-virtual-dtor -Wno-pedantic -DLDC_POSIX  -o CMakeFiles/ldmd2.dir/driver/ldmd.cpp.o -c /tmp/guix-build-ldc-0.17.1.drv-0/ldc-0.17.1/driver/ldmd.cpp
make[2]: Leaving directory '/tmp/guix-build-ldc-0.17.1.drv-0/build'
[  1%] Built target gen_gccbuiltins
make -f CMakeFiles/LDCShared.dir/build.make CMakeFiles/LDCShared.dir/depend
make[2]: Entering directory '/tmp/guix-build-ldc-0.17.1.drv-0/build'
[  1%] Generating dmd2/impcnvtab.c
cd /tmp/guix-build-ldc-0.17.1.drv-0/build/dmd2 && /tmp/guix-build-ldc-0.17.1.drv-0/build/dmd2/impcnvgen
[  1%] Generating dmd2/id.c, dmd2/id.h
cd /tmp/guix-build-ldc-0.17.1.drv-0/build/dmd2 && /tmp/guix-build-ldc-0.17.1.drv-0/build/dmd2/idgen
cd /tmp/guix-build-ldc-0.17.1.drv-0/build && /gnu/store/zcn7lm8lf60q0756q7z9qpvl9z5wbh82-cmake-3.5.2/bin/cmake -E cmake_depends "Unix Makefiles" /tmp/guix-build-ldc-0.17.1.drv-0/ldc-0.17.1 /tmp/guix-build-ldc-0.17.1.drv-0/ldc-0.17.1 /tmp/guix-build-ldc-0.17.1.drv-0/build /tmp/guix-build-ldc-0.17.1.drv-0/build /tmp/guix-build-ldc-0.17.1.drv-0/build/CMakeFiles/LDCShared.dir/DependInfo.cmake --color=
[  1%] Building CXX object CMakeFiles/ldmd2.dir/driver/response.cpp.o
/gnu/store/frrj3bfbmg5vrd0flh9cf8j64h7cr2v4-gcc-4.9.3/bin/c++   -DDMDV2 -DHAVE_SC_ARG_MAX -DIN_LLVM -DLDC_EXE_NAME=\"ldc2\" -DLDC_INSTALL_PREFIX=\"/gnu/store/zc31cgq0c1kppxsmvi53cpnrz74m99d1-ldc-0.17.1\" -DLDC_LLVM_VER=307 -DLLVM_INTRINSIC_TD_PATH=\"/gnu/store/2ycqrc4r56r5ww8ja8x4gz25qsp65v65-llvm-3.7.1/include\" -DOPAQUE_VTBLS -D__LITTLE_ENDIAN__ -I/tmp/guix-build-ldc-0.17.1.drv-0/ldc-0.17.1/. -I/tmp/guix-build-ldc-0.17.1.drv-0/ldc-0.17.1/dmd2 -I/tmp/guix-build-ldc-0.17.1.drv-0/ldc-0.17.1/dmd2/root -I/tmp/guix-build-ldc-0.17.1.drv-0/build/dmd2 -I/tmp/guix-build-ldc-0.17.1.drv-0/ldc-0.17.1 -isystem /gnu/store/2ycqrc4r56r5ww8ja8x4gz25qsp65v65-llvm-3.7.1/include -isystem /gnu/store/1v4anv1dwvskkav1zj08gicwaibachr1-libconfig-1.5/include  -O2 -g -DNDEBUG   -I/gnu/store/2ycqrc4r56r5ww8ja8x4gz25qsp65v65-llvm-3.7.1/include  -fPIC -fvisibility-inlines-hidden -Wall -W -Wno-unused-parameter -Wwrite-strings -Wcast-qual -Wno-missing-field-initializers -pedantic -Wno-long-long -Wno-maybe-uninitialized -Wno-comment -std=c++11 -ffunction-sections -fdata-sections -O3 -DNDEBUG -fno-exceptions -fno-rtti  -D_GNU_SOURCE -D__STDC_CONSTANT_MACROS -D__STDC_FORMAT_MACROS -D__STDC_LIMIT_MACROS  -Wall -Wextra -Wno-unused-parameter -Wno-missing-field-initializers -Wno-non-virtual-dtor -Wno-pedantic -DLDC_POSIX  -o CMakeFiles/ldmd2.dir/driver/response.cpp.o -c /tmp/guix-build-ldc-0.17.1.drv-0/ldc-0.17.1/driver/response.cpp
Scanning dependencies of target LDCShared
make[2]: Leaving directory '/tmp/guix-build-ldc-0.17.1.drv-0/build'
make -f CMakeFiles/LDCShared.dir/build.make CMakeFiles/LDCShared.dir/build
make[2]: Entering directory '/tmp/guix-build-ldc-0.17.1.drv-0/build'
[  1%] Building CXX object CMakeFiles/LDCShared.dir/dmd2/id.c.o
/gnu/store/frrj3bfbmg5vrd0flh9cf8j64h7cr2v4-gcc-4.9.3/bin/c++   -DDMDV2 -DHAVE_SC_ARG_MAX -DIN_LLVM -DLDC_INSTALL_PREFIX=\"/gnu/store/zc31cgq0c1kppxsmvi53cpnrz74m99d1-ldc-0.17.1\" -DLDC_LLVM_VER=307 -DLLVM_INTRINSIC_TD_PATH=\"/gnu/store/2ycqrc4r56r5ww8ja8x4gz25qsp65v65-llvm-3.7.1/include\" -DOPAQUE_VTBLS -D__LITTLE_ENDIAN__ -I/tmp/guix-build-ldc-0.17.1.drv-0/ldc-0.17.1/. -I/tmp/guix-build-ldc-0.17.1.drv-0/ldc-0.17.1/dmd2 -I/tmp/guix-build-ldc-0.17.1.drv-0/ldc-0.17.1/dmd2/root -I/tmp/guix-build-ldc-0.17.1.drv-0/build/dmd2 -I/tmp/guix-build-ldc-0.17.1.drv-0/ldc-0.17.1 -isystem /gnu/store/2ycqrc4r56r5ww8ja8x4gz25qsp65v65-llvm-3.7.1/include -isystem /gnu/store/1v4anv1dwvskkav1zj08gicwaibachr1-libconfig-1.5/include  -O2 -g -DNDEBUG   -I/gnu/store/2ycqrc4r56r5ww8ja8x4gz25qsp65v65-llvm-3.7.1/include  -fPIC -fvisibility-inlines-hidden -Wall -W -Wno-unused-parameter -Wwrite-strings -Wcast-qual -Wno-missing-field-initializers -pedantic -Wno-long-long -Wno-maybe-uninitialized -Wno-comment -std=c++11 -ffunction-sections -fdata-sections -O3 -DNDEBUG -fno-exceptions -fno-rtti  -D_GNU_SOURCE -D__STDC_CONSTANT_MACROS -D__STDC_FORMAT_MACROS -D__STDC_LIMIT_MACROS   -w -DPOSIX -DLDC_POSIX  -o CMakeFiles/LDCShared.dir/dmd2/id.c.o -c /tmp/guix-build-ldc-0.17.1.drv-0/build/dmd2/id.c
[  1%] Building CXX object CMakeFiles/LDCShared.dir/dmd2/impcnvtab.c.o
/gnu/store/frrj3bfbmg5vrd0flh9cf8j64h7cr2v4-gcc-4.9.3/bin/c++   -DDMDV2 -DHAVE_SC_ARG_MAX -DIN_LLVM -DLDC_INSTALL_PREFIX=\"/gnu/store/zc31cgq0c1kppxsmvi53cpnrz74m99d1-ldc-0.17.1\" -DLDC_LLVM_VER=307 -DLLVM_INTRINSIC_TD_PATH=\"/gnu/store/2ycqrc4r56r5ww8ja8x4gz25qsp65v65-llvm-3.7.1/include\" -DOPAQUE_VTBLS -D__LITTLE_ENDIAN__ -I/tmp/guix-build-ldc-0.17.1.drv-0/ldc-0.17.1/. -I/tmp/guix-build-ldc-0.17.1.drv-0/ldc-0.17.1/dmd2 -I/tmp/guix-build-ldc-0.17.1.drv-0/ldc-0.17.1/dmd2/root -I/tmp/guix-build-ldc-0.17.1.drv-0/build/dmd2 -I/tmp/guix-build-ldc-0.17.1.drv-0/ldc-0.17.1 -isystem /gnu/store/2ycqrc4r56r5ww8ja8x4gz25qsp65v65-llvm-3.7.1/include -isystem /gnu/store/1v4anv1dwvskkav1zj08gicwaibachr1-libconfig-1.5/include  -O2 -g -DNDEBUG   -I/gnu/store/2ycqrc4r56r5ww8ja8x4gz25qsp65v65-llvm-3.7.1/include  -fPIC -fvisibility-inlines-hidden -Wall -W -Wno-unused-parameter -Wwrite-strings -Wcast-qual -Wno-missing-field-initializers -pedantic -Wno-long-long -Wno-maybe-uninitialized -Wno-comment -std=c++11 -ffunction-sections -fdata-sections -O3 -DNDEBUG -fno-exceptions -fno-rtti  -D_GNU_SOURCE -D__STDC_CONSTANT_MACROS -D__STDC_FORMAT_MACROS -D__STDC_LIMIT_MACROS   -w -DPOSIX -DLDC_POSIX  -o CMakeFiles/LDCShared.dir/dmd2/impcnvtab.c.o -c /tmp/guix-build-ldc-0.17.1.drv-0/build/dmd2/impcnvtab.c
[  1%] Building CXX object CMakeFiles/LDCShared.dir/dmd2/version.c.o
/gnu/store/frrj3bfbmg5vrd0flh9cf8j64h7cr2v4-gcc-4.9.3/bin/c++   -DDMDV2 -DHAVE_SC_ARG_MAX -DIN_LLVM -DLDC_INSTALL_PREFIX=\"/gnu/store/zc31cgq0c1kppxsmvi53cpnrz74m99d1-ldc-0.17.1\" -DLDC_LLVM_VER=307 -DLLVM_INTRINSIC_TD_PATH=\"/gnu/store/2ycqrc4r56r5ww8ja8x4gz25qsp65v65-llvm-3.7.1/include\" -DOPAQUE_VTBLS -D__LITTLE_ENDIAN__ -I/tmp/guix-build-ldc-0.17.1.drv-0/ldc-0.17.1/. -I/tmp/guix-build-ldc-0.17.1.drv-0/ldc-0.17.1/dmd2 -I/tmp/guix-build-ldc-0.17.1.drv-0/ldc-0.17.1/dmd2/root -I/tmp/guix-build-ldc-0.17.1.drv-0/build/dmd2 -I/tmp/guix-build-ldc-0.17.1.drv-0/ldc-0.17.1 -isystem /gnu/store/2ycqrc4r56r5ww8ja8x4gz25qsp65v65-llvm-3.7.1/include -isystem /gnu/store/1v4anv1dwvskkav1zj08gicwaibachr1-libconfig-1.5/include  -O2 -g -DNDEBUG   -I/gnu/store/2ycqrc4r56r5ww8ja8x4gz25qsp65v65-llvm-3.7.1/include  -fPIC -fvisibility-inlines-hidden -Wall -W -Wno-unused-parameter -Wwrite-strings -Wcast-qual -Wno-missing-field-initializers -pedantic -Wno-long-long -Wno-maybe-uninitialized -Wno-comment -std=c++11 -ffunction-sections -fdata-sections -O3 -DNDEBUG -fno-exceptions -fno-rtti  -D_GNU_SOURCE -D__STDC_CONSTANT_MACROS -D__STDC_FORMAT_MACROS -D__STDC_LIMIT_MACROS   -w -DPOSIX -DLDC_POSIX  -o CMakeFiles/LDCShared.dir/dmd2/version.c.o -c /tmp/guix-build-ldc-0.17.1.drv-0/ldc-0.17.1/dmd2/version.c
[  1%] Linking CXX executable bin/FileCheck
/gnu/store/zcn7lm8lf60q0756q7z9qpvl9z5wbh82-cmake-3.5.2/bin/cmake -E cmake_link_script CMakeFiles/FileCheck.dir/link.txt --verbose=1
/gnu/store/frrj3bfbmg5vrd0flh9cf8j64h7cr2v4-gcc-4.9.3/bin/c++   -O2 -g -DNDEBUG   CMakeFiles/FileCheck.dir/utils/FileCheck-3.7.cpp.o  -o bin/FileCheck -rdynamic -lLLVMOption -lLLVMLTO -lLLVMObjCARCOpts -lLLVMLinker -lLLVMIRReader -lLLVMDebugInfoPDB -lLLVMDebugInfoDWARF -lLLVMBitWriter -lLLVMAsmParser -lLLVMXCoreDisassembler -lLLVMXCoreCodeGen -lLLVMXCoreDesc -lLLVMXCoreInfo -lLLVMXCoreAsmPrinter -lLLVMX86Disassembler -lLLVMX86AsmParser -lLLVMX86CodeGen -lLLVMX86Desc -lLLVMX86Info -lLLVMX86AsmPrinter -lLLVMX86Utils -lLLVMSystemZDisassembler -lLLVMSystemZCodeGen -lLLVMSystemZAsmParser -lLLVMSystemZDesc -lLLVMSystemZInfo -lLLVMSystemZAsmPrinter -lLLVMSparcDisassembler -lLLVMSparcCodeGen -lLLVMSparcAsmParser -lLLVMSparcDesc -lLLVMSparcInfo -lLLVMSparcAsmPrinter -lLLVMPowerPCDisassembler -lLLVMPowerPCCodeGen -lLLVMPowerPCAsmParser -lLLVMPowerPCDesc -lLLVMPowerPCInfo -lLLVMPowerPCAsmPrinter -lLLVMNVPTXCodeGen -lLLVMNVPTXDesc -lLLVMNVPTXInfo -lLLVMNVPTXAsmPrinter -lLLVMMSP430CodeGen -lLLVMMSP430Desc -lLLVMMSP430Info -lLLVMMSP430AsmPrinter -lLLVMMipsDisassembler -lLLVMMipsCodeGen -lLLVMMipsAsmParser -lLLVMMipsDesc -lLLVMMipsInfo -lLLVMMipsAsmPrinter -lLLVMHexagonDisassembler -lLLVMHexagonCodeGen -lLLVMHexagonDesc -lLLVMHexagonInfo -lLLVMCppBackendCodeGen -lLLVMCppBackendInfo -lLLVMBPFCodeGen -lLLVMBPFDesc -lLLVMBPFInfo -lLLVMBPFAsmPrinter -lLLVMARMDisassembler -lLLVMARMCodeGen -lLLVMARMAsmParser -lLLVMARMDesc -lLLVMARMInfo -lLLVMARMAsmPrinter -lLLVMAMDGPUCodeGen -lLLVMipo -lLLVMVectorize -lLLVMAMDGPUAsmParser -lLLVMAMDGPUUtils -lLLVMAMDGPUDesc -lLLVMAMDGPUInfo -lLLVMAMDGPUAsmPrinter -lLLVMAArch64Disassembler -lLLVMMCDisassembler -lLLVMAArch64CodeGen -lLLVMSelectionDAG -lLLVMAsmPrinter -lLLVMCodeGen -lLLVMTarget -lLLVMScalarOpts -lLLVMProfileData -lLLVMObject -lLLVMBitReader -lLLVMInstCombine -lLLVMInstrumentation -lLLVMTransformUtils -lLLVMipa -lLLVMAnalysis -lLLVMCore -lLLVMAArch64AsmParser -lLLVMMCParser -lLLVMAArch64Desc -lLLVMAArch64Info -lLLVMAArch64AsmPrinter -lLLVMMC -lLLVMAArch64Utils -lLLVMSupport -ldl -L/gnu/store/2ycqrc4r56r5ww8ja8x4gz25qsp65v65-llvm-3.7.1/lib -lrt -ldl -lpthread -lz -lm 
make[2]: Leaving directory '/tmp/guix-build-ldc-0.17.1.drv-0/build'
[  1%] Built target FileCheck
[  1%] Building CXX object CMakeFiles/LDCShared.dir/dmd2/utf.c.o
/gnu/store/frrj3bfbmg5vrd0flh9cf8j64h7cr2v4-gcc-4.9.3/bin/c++   -DDMDV2 -DHAVE_SC_ARG_MAX -DIN_LLVM -DLDC_INSTALL_PREFIX=\"/gnu/store/zc31cgq0c1kppxsmvi53cpnrz74m99d1-ldc-0.17.1\" -DLDC_LLVM_VER=307 -DLLVM_INTRINSIC_TD_PATH=\"/gnu/store/2ycqrc4r56r5ww8ja8x4gz25qsp65v65-llvm-3.7.1/include\" -DOPAQUE_VTBLS -D__LITTLE_ENDIAN__ -I/tmp/guix-build-ldc-0.17.1.drv-0/ldc-0.17.1/. -I/tmp/guix-build-ldc-0.17.1.drv-0/ldc-0.17.1/dmd2 -I/tmp/guix-build-ldc-0.17.1.drv-0/ldc-0.17.1/dmd2/root -I/tmp/guix-build-ldc-0.17.1.drv-0/build/dmd2 -I/tmp/guix-build-ldc-0.17.1.drv-0/ldc-0.17.1 -isystem /gnu/store/2ycqrc4r56r5ww8ja8x4gz25qsp65v65-llvm-3.7.1/include -isystem /gnu/store/1v4anv1dwvskkav1zj08gicwaibachr1-libconfig-1.5/include  -O2 -g -DNDEBUG   -I/gnu/store/2ycqrc4r56r5ww8ja8x4gz25qsp65v65-llvm-3.7.1/include  -fPIC -fvisibility-inlines-hidden -Wall -W -Wno-unused-parameter -Wwrite-strings -Wcast-qual -Wno-missing-field-initializers -pedantic -Wno-long-long -Wno-maybe-uninitialized -Wno-comment -std=c++11 -ffunction-sections -fdata-sections -O3 -DNDEBUG -fno-exceptions -fno-rtti  -D_GNU_SOURCE -D__STDC_CONSTANT_MACROS -D__STDC_FORMAT_MACROS -D__STDC_LIMIT_MACROS   -w -DPOSIX -DLDC_POSIX  -o CMakeFiles/LDCShared.dir/dmd2/utf.c.o -c /tmp/guix-build-ldc-0.17.1.drv-0/ldc-0.17.1/dmd2/utf.c
[  3%] Linking CXX executable bin/ldmd2
/gnu/store/zcn7lm8lf60q0756q7z9qpvl9z5wbh82-cmake-3.5.2/bin/cmake -E cmake_link_script CMakeFiles/ldmd2.dir/link.txt --verbose=1
[  3%] Building CXX object CMakeFiles/LDCShared.dir/dmd2/unittests.c.o
/gnu/store/frrj3bfbmg5vrd0flh9cf8j64h7cr2v4-gcc-4.9.3/bin/c++   -DDMDV2 -DHAVE_SC_ARG_MAX -DIN_LLVM -DLDC_INSTALL_PREFIX=\"/gnu/store/zc31cgq0c1kppxsmvi53cpnrz74m99d1-ldc-0.17.1\" -DLDC_LLVM_VER=307 -DLLVM_INTRINSIC_TD_PATH=\"/gnu/store/2ycqrc4r56r5ww8ja8x4gz25qsp65v65-llvm-3.7.1/include\" -DOPAQUE_VTBLS -D__LITTLE_ENDIAN__ -I/tmp/guix-build-ldc-0.17.1.drv-0/ldc-0.17.1/. -I/tmp/guix-build-ldc-0.17.1.drv-0/ldc-0.17.1/dmd2 -I/tmp/guix-build-ldc-0.17.1.drv-0/ldc-0.17.1/dmd2/root -I/tmp/guix-build-ldc-0.17.1.drv-0/build/dmd2 -I/tmp/guix-build-ldc-0.17.1.drv-0/ldc-0.17.1 -isystem /gnu/store/2ycqrc4r56r5ww8ja8x4gz25qsp65v65-llvm-3.7.1/include -isystem /gnu/store/1v4anv1dwvskkav1zj08gicwaibachr1-libconfig-1.5/include  -O2 -g -DNDEBUG   -I/gnu/store/2ycqrc4r56r5ww8ja8x4gz25qsp65v65-llvm-3.7.1/include  -fPIC -fvisibility-inlines-hidden -Wall -W -Wno-unused-parameter -Wwrite-strings -Wcast-qual -Wno-missing-field-initializers -pedantic -Wno-long-long -Wno-maybe-uninitialized -Wno-comment -std=c++11 -ffunction-sections -fdata-sections -O3 -DNDEBUG -fno-exceptions -fno-rtti  -D_GNU_SOURCE -D__STDC_CONSTANT_MACROS -D__STDC_FORMAT_MACROS -D__STDC_LIMIT_MACROS   -w -DPOSIX -DLDC_POSIX  -o CMakeFiles/LDCShared.dir/dmd2/unittests.c.o -c /tmp/guix-build-ldc-0.17.1.drv-0/ldc-0.17.1/dmd2/unittests.c
/gnu/store/frrj3bfbmg5vrd0flh9cf8j64h7cr2v4-gcc-4.9.3/bin/c++   -O2 -g -DNDEBUG   CMakeFiles/ldmd2.dir/dmd2/root/man.c.o CMakeFiles/ldmd2.dir/driver/exe_path.cpp.o CMakeFiles/ldmd2.dir/driver/ldmd.cpp.o CMakeFiles/ldmd2.dir/driver/response.cpp.o  -o bin/ldmd2 -rdynamic -lLLVMOption -lLLVMLTO -lLLVMObjCARCOpts -lLLVMLinker -lLLVMIRReader -lLLVMDebugInfoPDB -lLLVMDebugInfoDWARF -lLLVMBitWriter -lLLVMAsmParser -lLLVMXCoreDisassembler -lLLVMXCoreCodeGen -lLLVMXCoreDesc -lLLVMXCoreInfo -lLLVMXCoreAsmPrinter -lLLVMX86Disassembler -lLLVMX86AsmParser -lLLVMX86CodeGen -lLLVMX86Desc -lLLVMX86Info -lLLVMX86AsmPrinter -lLLVMX86Utils -lLLVMSystemZDisassembler -lLLVMSystemZCodeGen -lLLVMSystemZAsmParser -lLLVMSystemZDesc -lLLVMSystemZInfo -lLLVMSystemZAsmPrinter -lLLVMSparcDisassembler -lLLVMSparcCodeGen -lLLVMSparcAsmParser -lLLVMSparcDesc -lLLVMSparcInfo -lLLVMSparcAsmPrinter -lLLVMPowerPCDisassembler -lLLVMPowerPCCodeGen -lLLVMPowerPCAsmParser -lLLVMPowerPCDesc -lLLVMPowerPCInfo -lLLVMPowerPCAsmPrinter -lLLVMNVPTXCodeGen -lLLVMNVPTXDesc -lLLVMNVPTXInfo -lLLVMNVPTXAsmPrinter -lLLVMMSP430CodeGen -lLLVMMSP430Desc -lLLVMMSP430Info -lLLVMMSP430AsmPrinter -lLLVMMipsDisassembler -lLLVMMipsCodeGen -lLLVMMipsAsmParser -lLLVMMipsDesc -lLLVMMipsInfo -lLLVMMipsAsmPrinter -lLLVMHexagonDisassembler -lLLVMHexagonCodeGen -lLLVMHexagonDesc -lLLVMHexagonInfo -lLLVMCppBackendCodeGen -lLLVMCppBackendInfo -lLLVMBPFCodeGen -lLLVMBPFDesc -lLLVMBPFInfo -lLLVMBPFAsmPrinter -lLLVMARMDisassembler -lLLVMARMCodeGen -lLLVMARMAsmParser -lLLVMARMDesc -lLLVMARMInfo -lLLVMARMAsmPrinter -lLLVMAMDGPUCodeGen -lLLVMipo -lLLVMVectorize -lLLVMAMDGPUAsmParser -lLLVMAMDGPUUtils -lLLVMAMDGPUDesc -lLLVMAMDGPUInfo -lLLVMAMDGPUAsmPrinter -lLLVMAArch64Disassembler -lLLVMMCDisassembler -lLLVMAArch64CodeGen -lLLVMSelectionDAG -lLLVMAsmPrinter -lLLVMCodeGen -lLLVMTarget -lLLVMScalarOpts -lLLVMProfileData -lLLVMObject -lLLVMBitReader -lLLVMInstCombine -lLLVMInstrumentation -lLLVMTransformUtils -lLLVMipa -lLLVMAnalysis -lLLVMCore -lLLVMAArch64AsmParser -lLLVMMCParser -lLLVMAArch64Desc -lLLVMAArch64Info -lLLVMAArch64AsmPrinter -lLLVMMC -lLLVMAArch64Utils -lLLVMSupport -lpthread -ldl -L/gnu/store/2ycqrc4r56r5ww8ja8x4gz25qsp65v65-llvm-3.7.1/lib -lrt -ldl -lpthread -lz -lm -Wl,-rpath,:::::::::::::::::::::::::::::::::::::::::::::::::::::::::: 
[  3%] Building CXX object CMakeFiles/LDCShared.dir/dmd2/traits.c.o
/gnu/store/frrj3bfbmg5vrd0flh9cf8j64h7cr2v4-gcc-4.9.3/bin/c++   -DDMDV2 -DHAVE_SC_ARG_MAX -DIN_LLVM -DLDC_INSTALL_PREFIX=\"/gnu/store/zc31cgq0c1kppxsmvi53cpnrz74m99d1-ldc-0.17.1\" -DLDC_LLVM_VER=307 -DLLVM_INTRINSIC_TD_PATH=\"/gnu/store/2ycqrc4r56r5ww8ja8x4gz25qsp65v65-llvm-3.7.1/include\" -DOPAQUE_VTBLS -D__LITTLE_ENDIAN__ -I/tmp/guix-build-ldc-0.17.1.drv-0/ldc-0.17.1/. -I/tmp/guix-build-ldc-0.17.1.drv-0/ldc-0.17.1/dmd2 -I/tmp/guix-build-ldc-0.17.1.drv-0/ldc-0.17.1/dmd2/root -I/tmp/guix-build-ldc-0.17.1.drv-0/build/dmd2 -I/tmp/guix-build-ldc-0.17.1.drv-0/ldc-0.17.1 -isystem /gnu/store/2ycqrc4r56r5ww8ja8x4gz25qsp65v65-llvm-3.7.1/include -isystem /gnu/store/1v4anv1dwvskkav1zj08gicwaibachr1-libconfig-1.5/include  -O2 -g -DNDEBUG   -I/gnu/store/2ycqrc4r56r5ww8ja8x4gz25qsp65v65-llvm-3.7.1/include  -fPIC -fvisibility-inlines-hidden -Wall -W -Wno-unused-parameter -Wwrite-strings -Wcast-qual -Wno-missing-field-initializers -pedantic -Wno-long-long -Wno-maybe-uninitialized -Wno-comment -std=c++11 -ffunction-sections -fdata-sections -O3 -DNDEBUG -fno-exceptions -fno-rtti  -D_GNU_SOURCE -D__STDC_CONSTANT_MACROS -D__STDC_FORMAT_MACROS -D__STDC_LIMIT_MACROS   -w -DPOSIX -DLDC_POSIX  -o CMakeFiles/LDCShared.dir/dmd2/traits.c.o -c /tmp/guix-build-ldc-0.17.1.drv-0/ldc-0.17.1/dmd2/traits.c
make[2]: Leaving directory '/tmp/guix-build-ldc-0.17.1.drv-0/build'
[  3%] Built target ldmd2
[  3%] Building CXX object CMakeFiles/LDCShared.dir/dmd2/tokens.c.o
/gnu/store/frrj3bfbmg5vrd0flh9cf8j64h7cr2v4-gcc-4.9.3/bin/c++   -DDMDV2 -DHAVE_SC_ARG_MAX -DIN_LLVM -DLDC_INSTALL_PREFIX=\"/gnu/store/zc31cgq0c1kppxsmvi53cpnrz74m99d1-ldc-0.17.1\" -DLDC_LLVM_VER=307 -DLLVM_INTRINSIC_TD_PATH=\"/gnu/store/2ycqrc4r56r5ww8ja8x4gz25qsp65v65-llvm-3.7.1/include\" -DOPAQUE_VTBLS -D__LITTLE_ENDIAN__ -I/tmp/guix-build-ldc-0.17.1.drv-0/ldc-0.17.1/. -I/tmp/guix-build-ldc-0.17.1.drv-0/ldc-0.17.1/dmd2 -I/tmp/guix-build-ldc-0.17.1.drv-0/ldc-0.17.1/dmd2/root -I/tmp/guix-build-ldc-0.17.1.drv-0/build/dmd2 -I/tmp/guix-build-ldc-0.17.1.drv-0/ldc-0.17.1 -isystem /gnu/store/2ycqrc4r56r5ww8ja8x4gz25qsp65v65-llvm-3.7.1/include -isystem /gnu/store/1v4anv1dwvskkav1zj08gicwaibachr1-libconfig-1.5/include  -O2 -g -DNDEBUG   -I/gnu/store/2ycqrc4r56r5ww8ja8x4gz25qsp65v65-llvm-3.7.1/include  -fPIC -fvisibility-inlines-hidden -Wall -W -Wno-unused-parameter -Wwrite-strings -Wcast-qual -Wno-missing-field-initializers -pedantic -Wno-long-long -Wno-maybe-uninitialized -Wno-comment -std=c++11 -ffunction-sections -fdata-sections -O3 -DNDEBUG -fno-exceptions -fno-rtti  -D_GNU_SOURCE -D__STDC_CONSTANT_MACROS -D__STDC_FORMAT_MACROS -D__STDC_LIMIT_MACROS   -w -DPOSIX -DLDC_POSIX  -o CMakeFiles/LDCShared.dir/dmd2/tokens.c.o -c /tmp/guix-build-ldc-0.17.1.drv-0/ldc-0.17.1/dmd2/tokens.c
[  3%] Building CXX object CMakeFiles/LDCShared.dir/dmd2/template.c.o
/gnu/store/frrj3bfbmg5vrd0flh9cf8j64h7cr2v4-gcc-4.9.3/bin/c++   -DDMDV2 -DHAVE_SC_ARG_MAX -DIN_LLVM -DLDC_INSTALL_PREFIX=\"/gnu/store/zc31cgq0c1kppxsmvi53cpnrz74m99d1-ldc-0.17.1\" -DLDC_LLVM_VER=307 -DLLVM_INTRINSIC_TD_PATH=\"/gnu/store/2ycqrc4r56r5ww8ja8x4gz25qsp65v65-llvm-3.7.1/include\" -DOPAQUE_VTBLS -D__LITTLE_ENDIAN__ -I/tmp/guix-build-ldc-0.17.1.drv-0/ldc-0.17.1/. -I/tmp/guix-build-ldc-0.17.1.drv-0/ldc-0.17.1/dmd2 -I/tmp/guix-build-ldc-0.17.1.drv-0/ldc-0.17.1/dmd2/root -I/tmp/guix-build-ldc-0.17.1.drv-0/build/dmd2 -I/tmp/guix-build-ldc-0.17.1.drv-0/ldc-0.17.1 -isystem /gnu/store/2ycqrc4r56r5ww8ja8x4gz25qsp65v65-llvm-3.7.1/include -isystem /gnu/store/1v4anv1dwvskkav1zj08gicwaibachr1-libconfig-1.5/include  -O2 -g -DNDEBUG   -I/gnu/store/2ycqrc4r56r5ww8ja8x4gz25qsp65v65-llvm-3.7.1/include  -fPIC -fvisibility-inlines-hidden -Wall -W -Wno-unused-parameter -Wwrite-strings -Wcast-qual -Wno-missing-field-initializers -pedantic -Wno-long-long -Wno-maybe-uninitialized -Wno-comment -std=c++11 -ffunction-sections -fdata-sections -O3 -DNDEBUG -fno-exceptions -fno-rtti  -D_GNU_SOURCE -D__STDC_CONSTANT_MACROS -D__STDC_FORMAT_MACROS -D__STDC_LIMIT_MACROS   -w -DPOSIX -DLDC_POSIX  -o CMakeFiles/LDCShared.dir/dmd2/template.c.o -c /tmp/guix-build-ldc-0.17.1.drv-0/ldc-0.17.1/dmd2/template.c
[  3%] Building CXX object CMakeFiles/LDCShared.dir/dmd2/struct.c.o
/gnu/store/frrj3bfbmg5vrd0flh9cf8j64h7cr2v4-gcc-4.9.3/bin/c++   -DDMDV2 -DHAVE_SC_ARG_MAX -DIN_LLVM -DLDC_INSTALL_PREFIX=\"/gnu/store/zc31cgq0c1kppxsmvi53cpnrz74m99d1-ldc-0.17.1\" -DLDC_LLVM_VER=307 -DLLVM_INTRINSIC_TD_PATH=\"/gnu/store/2ycqrc4r56r5ww8ja8x4gz25qsp65v65-llvm-3.7.1/include\" -DOPAQUE_VTBLS -D__LITTLE_ENDIAN__ -I/tmp/guix-build-ldc-0.17.1.drv-0/ldc-0.17.1/. -I/tmp/guix-build-ldc-0.17.1.drv-0/ldc-0.17.1/dmd2 -I/tmp/guix-build-ldc-0.17.1.drv-0/ldc-0.17.1/dmd2/root -I/tmp/guix-build-ldc-0.17.1.drv-0/build/dmd2 -I/tmp/guix-build-ldc-0.17.1.drv-0/ldc-0.17.1 -isystem /gnu/store/2ycqrc4r56r5ww8ja8x4gz25qsp65v65-llvm-3.7.1/include -isystem /gnu/store/1v4anv1dwvskkav1zj08gicwaibachr1-libconfig-1.5/include  -O2 -g -DNDEBUG   -I/gnu/store/2ycqrc4r56r5ww8ja8x4gz25qsp65v65-llvm-3.7.1/include  -fPIC -fvisibility-inlines-hidden -Wall -W -Wno-unused-parameter -Wwrite-strings -Wcast-qual -Wno-missing-field-initializers -pedantic -Wno-long-long -Wno-maybe-uninitialized -Wno-comment -std=c++11 -ffunction-sections -fdata-sections -O3 -DNDEBUG -fno-exceptions -fno-rtti  -D_GNU_SOURCE -D__STDC_CONSTANT_MACROS -D__STDC_FORMAT_MACROS -D__STDC_LIMIT_MACROS   -w -DPOSIX -DLDC_POSIX  -o CMakeFiles/LDCShared.dir/dmd2/struct.c.o -c /tmp/guix-build-ldc-0.17.1.drv-0/ldc-0.17.1/dmd2/struct.c
[  3%] Building CXX object CMakeFiles/LDCShared.dir/dmd2/staticassert.c.o
/gnu/store/frrj3bfbmg5vrd0flh9cf8j64h7cr2v4-gcc-4.9.3/bin/c++   -DDMDV2 -DHAVE_SC_ARG_MAX -DIN_LLVM -DLDC_INSTALL_PREFIX=\"/gnu/store/zc31cgq0c1kppxsmvi53cpnrz74m99d1-ldc-0.17.1\" -DLDC_LLVM_VER=307 -DLLVM_INTRINSIC_TD_PATH=\"/gnu/store/2ycqrc4r56r5ww8ja8x4gz25qsp65v65-llvm-3.7.1/include\" -DOPAQUE_VTBLS -D__LITTLE_ENDIAN__ -I/tmp/guix-build-ldc-0.17.1.drv-0/ldc-0.17.1/. -I/tmp/guix-build-ldc-0.17.1.drv-0/ldc-0.17.1/dmd2 -I/tmp/guix-build-ldc-0.17.1.drv-0/ldc-0.17.1/dmd2/root -I/tmp/guix-build-ldc-0.17.1.drv-0/build/dmd2 -I/tmp/guix-build-ldc-0.17.1.drv-0/ldc-0.17.1 -isystem /gnu/store/2ycqrc4r56r5ww8ja8x4gz25qsp65v65-llvm-3.7.1/include -isystem /gnu/store/1v4anv1dwvskkav1zj08gicwaibachr1-libconfig-1.5/include  -O2 -g -DNDEBUG   -I/gnu/store/2ycqrc4r56r5ww8ja8x4gz25qsp65v65-llvm-3.7.1/include  -fPIC -fvisibility-inlines-hidden -Wall -W -Wno-unused-parameter -Wwrite-strings -Wcast-qual -Wno-missing-field-initializers -pedantic -Wno-long-long -Wno-maybe-uninitialized -Wno-comment -std=c++11 -ffunction-sections -fdata-sections -O3 -DNDEBUG -fno-exceptions -fno-rtti  -D_GNU_SOURCE -D__STDC_CONSTANT_MACROS -D__STDC_FORMAT_MACROS -D__STDC_LIMIT_MACROS   -w -DPOSIX -DLDC_POSIX  -o CMakeFiles/LDCShared.dir/dmd2/staticassert.c.o -c /tmp/guix-build-ldc-0.17.1.drv-0/ldc-0.17.1/dmd2/staticassert.c
[  3%] Building CXX object CMakeFiles/LDCShared.dir/dmd2/statement.c.o
/gnu/store/frrj3bfbmg5vrd0flh9cf8j64h7cr2v4-gcc-4.9.3/bin/c++   -DDMDV2 -DHAVE_SC_ARG_MAX -DIN_LLVM -DLDC_INSTALL_PREFIX=\"/gnu/store/zc31cgq0c1kppxsmvi53cpnrz74m99d1-ldc-0.17.1\" -DLDC_LLVM_VER=307 -DLLVM_INTRINSIC_TD_PATH=\"/gnu/store/2ycqrc4r56r5ww8ja8x4gz25qsp65v65-llvm-3.7.1/include\" -DOPAQUE_VTBLS -D__LITTLE_ENDIAN__ -I/tmp/guix-build-ldc-0.17.1.drv-0/ldc-0.17.1/. -I/tmp/guix-build-ldc-0.17.1.drv-0/ldc-0.17.1/dmd2 -I/tmp/guix-build-ldc-0.17.1.drv-0/ldc-0.17.1/dmd2/root -I/tmp/guix-build-ldc-0.17.1.drv-0/build/dmd2 -I/tmp/guix-build-ldc-0.17.1.drv-0/ldc-0.17.1 -isystem /gnu/store/2ycqrc4r56r5ww8ja8x4gz25qsp65v65-llvm-3.7.1/include -isystem /gnu/store/1v4anv1dwvskkav1zj08gicwaibachr1-libconfig-1.5/include  -O2 -g -DNDEBUG   -I/gnu/store/2ycqrc4r56r5ww8ja8x4gz25qsp65v65-llvm-3.7.1/include  -fPIC -fvisibility-inlines-hidden -Wall -W -Wno-unused-parameter -Wwrite-strings -Wcast-qual -Wno-missing-field-initializers -pedantic -Wno-long-long -Wno-maybe-uninitialized -Wno-comment -std=c++11 -ffunction-sections -fdata-sections -O3 -DNDEBUG -fno-exceptions -fno-rtti  -D_GNU_SOURCE -D__STDC_CONSTANT_MACROS -D__STDC_FORMAT_MACROS -D__STDC_LIMIT_MACROS   -w -DPOSIX -DLDC_POSIX  -o CMakeFiles/LDCShared.dir/dmd2/statement.c.o -c /tmp/guix-build-ldc-0.17.1.drv-0/ldc-0.17.1/dmd2/statement.c
[  3%] Building CXX object CMakeFiles/LDCShared.dir/dmd2/sideeffect.c.o
/gnu/store/frrj3bfbmg5vrd0flh9cf8j64h7cr2v4-gcc-4.9.3/bin/c++   -DDMDV2 -DHAVE_SC_ARG_MAX -DIN_LLVM -DLDC_INSTALL_PREFIX=\"/gnu/store/zc31cgq0c1kppxsmvi53cpnrz74m99d1-ldc-0.17.1\" -DLDC_LLVM_VER=307 -DLLVM_INTRINSIC_TD_PATH=\"/gnu/store/2ycqrc4r56r5ww8ja8x4gz25qsp65v65-llvm-3.7.1/include\" -DOPAQUE_VTBLS -D__LITTLE_ENDIAN__ -I/tmp/guix-build-ldc-0.17.1.drv-0/ldc-0.17.1/. -I/tmp/guix-build-ldc-0.17.1.drv-0/ldc-0.17.1/dmd2 -I/tmp/guix-build-ldc-0.17.1.drv-0/ldc-0.17.1/dmd2/root -I/tmp/guix-build-ldc-0.17.1.drv-0/build/dmd2 -I/tmp/guix-build-ldc-0.17.1.drv-0/ldc-0.17.1 -isystem /gnu/store/2ycqrc4r56r5ww8ja8x4gz25qsp65v65-llvm-3.7.1/include -isystem /gnu/store/1v4anv1dwvskkav1zj08gicwaibachr1-libconfig-1.5/include  -O2 -g -DNDEBUG   -I/gnu/store/2ycqrc4r56r5ww8ja8x4gz25qsp65v65-llvm-3.7.1/include  -fPIC -fvisibility-inlines-hidden -Wall -W -Wno-unused-parameter -Wwrite-strings -Wcast-qual -Wno-missing-field-initializers -pedantic -Wno-long-long -Wno-maybe-uninitialized -Wno-comment -std=c++11 -ffunction-sections -fdata-sections -O3 -DNDEBUG -fno-exceptions -fno-rtti  -D_GNU_SOURCE -D__STDC_CONSTANT_MACROS -D__STDC_FORMAT_MACROS -D__STDC_LIMIT_MACROS   -w -DPOSIX -DLDC_POSIX  -o CMakeFiles/LDCShared.dir/dmd2/sideeffect.c.o -c /tmp/guix-build-ldc-0.17.1.drv-0/ldc-0.17.1/dmd2/sideeffect.c
[  5%] Building CXX object CMakeFiles/LDCShared.dir/dmd2/scope.c.o
/gnu/store/frrj3bfbmg5vrd0flh9cf8j64h7cr2v4-gcc-4.9.3/bin/c++   -DDMDV2 -DHAVE_SC_ARG_MAX -DIN_LLVM -DLDC_INSTALL_PREFIX=\"/gnu/store/zc31cgq0c1kppxsmvi53cpnrz74m99d1-ldc-0.17.1\" -DLDC_LLVM_VER=307 -DLLVM_INTRINSIC_TD_PATH=\"/gnu/store/2ycqrc4r56r5ww8ja8x4gz25qsp65v65-llvm-3.7.1/include\" -DOPAQUE_VTBLS -D__LITTLE_ENDIAN__ -I/tmp/guix-build-ldc-0.17.1.drv-0/ldc-0.17.1/. -I/tmp/guix-build-ldc-0.17.1.drv-0/ldc-0.17.1/dmd2 -I/tmp/guix-build-ldc-0.17.1.drv-0/ldc-0.17.1/dmd2/root -I/tmp/guix-build-ldc-0.17.1.drv-0/build/dmd2 -I/tmp/guix-build-ldc-0.17.1.drv-0/ldc-0.17.1 -isystem /gnu/store/2ycqrc4r56r5ww8ja8x4gz25qsp65v65-llvm-3.7.1/include -isystem /gnu/store/1v4anv1dwvskkav1zj08gicwaibachr1-libconfig-1.5/include  -O2 -g -DNDEBUG   -I/gnu/store/2ycqrc4r56r5ww8ja8x4gz25qsp65v65-llvm-3.7.1/include  -fPIC -fvisibility-inlines-hidden -Wall -W -Wno-unused-parameter -Wwrite-strings -Wcast-qual -Wno-missing-field-initializers -pedantic -Wno-long-long -Wno-maybe-uninitialized -Wno-comment -std=c++11 -ffunction-sections -fdata-sections -O3 -DNDEBUG -fno-exceptions -fno-rtti  -D_GNU_SOURCE -D__STDC_CONSTANT_MACROS -D__STDC_FORMAT_MACROS -D__STDC_LIMIT_MACROS   -w -DPOSIX -DLDC_POSIX  -o CMakeFiles/LDCShared.dir/dmd2/scope.c.o -c /tmp/guix-build-ldc-0.17.1.drv-0/ldc-0.17.1/dmd2/scope.c
[  5%] Building CXX object CMakeFiles/LDCShared.dir/dmd2/sapply.c.o
[  5%] Building CXX object CMakeFiles/LDCShared.dir/dmd2/root/port.c.o
/gnu/store/frrj3bfbmg5vrd0flh9cf8j64h7cr2v4-gcc-4.9.3/bin/c++   -DDMDV2 -DHAVE_SC_ARG_MAX -DIN_LLVM -DLDC_INSTALL_PREFIX=\"/gnu/store/zc31cgq0c1kppxsmvi53cpnrz74m99d1-ldc-0.17.1\" -DLDC_LLVM_VER=307 -DLLVM_INTRINSIC_TD_PATH=\"/gnu/store/2ycqrc4r56r5ww8ja8x4gz25qsp65v65-llvm-3.7.1/include\" -DOPAQUE_VTBLS -D__LITTLE_ENDIAN__ -I/tmp/guix-build-ldc-0.17.1.drv-0/ldc-0.17.1/. -I/tmp/guix-build-ldc-0.17.1.drv-0/ldc-0.17.1/dmd2 -I/tmp/guix-build-ldc-0.17.1.drv-0/ldc-0.17.1/dmd2/root -I/tmp/guix-build-ldc-0.17.1.drv-0/build/dmd2 -I/tmp/guix-build-ldc-0.17.1.drv-0/ldc-0.17.1 -isystem /gnu/store/2ycqrc4r56r5ww8ja8x4gz25qsp65v65-llvm-3.7.1/include -isystem /gnu/store/1v4anv1dwvskkav1zj08gicwaibachr1-libconfig-1.5/include  -O2 -g -DNDEBUG   -I/gnu/store/2ycqrc4r56r5ww8ja8x4gz25qsp65v65-llvm-3.7.1/include  -fPIC -fvisibility-inlines-hidden -Wall -W -Wno-unused-parameter -Wwrite-strings -Wcast-qual -Wno-missing-field-initializers -pedantic -Wno-long-long -Wno-maybe-uninitialized -Wno-comment -std=c++11 -ffunction-sections -fdata-sections -O3 -DNDEBUG -fno-exceptions -fno-rtti  -D_GNU_SOURCE -D__STDC_CONSTANT_MACROS -D__STDC_FORMAT_MACROS -D__STDC_LIMIT_MACROS   -w -DPOSIX -DLDC_POSIX  -o CMakeFiles/LDCShared.dir/dmd2/root/port.c.o -c /tmp/guix-build-ldc-0.17.1.drv-0/ldc-0.17.1/dmd2/root/port.c
/gnu/store/frrj3bfbmg5vrd0flh9cf8j64h7cr2v4-gcc-4.9.3/bin/c++   -DDMDV2 -DHAVE_SC_ARG_MAX -DIN_LLVM -DLDC_INSTALL_PREFIX=\"/gnu/store/zc31cgq0c1kppxsmvi53cpnrz74m99d1-ldc-0.17.1\" -DLDC_LLVM_VER=307 -DLLVM_INTRINSIC_TD_PATH=\"/gnu/store/2ycqrc4r56r5ww8ja8x4gz25qsp65v65-llvm-3.7.1/include\" -DOPAQUE_VTBLS -D__LITTLE_ENDIAN__ -I/tmp/guix-build-ldc-0.17.1.drv-0/ldc-0.17.1/. -I/tmp/guix-build-ldc-0.17.1.drv-0/ldc-0.17.1/dmd2 -I/tmp/guix-build-ldc-0.17.1.drv-0/ldc-0.17.1/dmd2/root -I/tmp/guix-build-ldc-0.17.1.drv-0/build/dmd2 -I/tmp/guix-build-ldc-0.17.1.drv-0/ldc-0.17.1 -isystem /gnu/store/2ycqrc4r56r5ww8ja8x4gz25qsp65v65-llvm-3.7.1/include -isystem /gnu/store/1v4anv1dwvskkav1zj08gicwaibachr1-libconfig-1.5/include  -O2 -g -DNDEBUG   -I/gnu/store/2ycqrc4r56r5ww8ja8x4gz25qsp65v65-llvm-3.7.1/include  -fPIC -fvisibility-inlines-hidden -Wall -W -Wno-unused-parameter -Wwrite-strings -Wcast-qual -Wno-missing-field-initializers -pedantic -Wno-long-long -Wno-maybe-uninitialized -Wno-comment -std=c++11 -ffunction-sections -fdata-sections -O3 -DNDEBUG -fno-exceptions -fno-rtti  -D_GNU_SOURCE -D__STDC_CONSTANT_MACROS -D__STDC_FORMAT_MACROS -D__STDC_LIMIT_MACROS   -w -DPOSIX -DLDC_POSIX  -o CMakeFiles/LDCShared.dir/dmd2/sapply.c.o -c /tmp/guix-build-ldc-0.17.1.drv-0/ldc-0.17.1/dmd2/sapply.c
/tmp/guix-build-ldc-0.17.1.drv-0/ldc-0.17.1/dmd2/root/port.c: In static member function ?static int Port::isNan(double)?:
/tmp/guix-build-ldc-0.17.1.drv-0/ldc-0.17.1/dmd2/root/port.c:773:19: error: ?isnan? was not declared in this scope
     return isnan(r);
                   ^
/tmp/guix-build-ldc-0.17.1.drv-0/ldc-0.17.1/dmd2/root/port.c:773:19: note: suggested alternative:
In file included from /gnu/store/2ycqrc4r56r5ww8ja8x4gz25qsp65v65-llvm-3.7.1/include/llvm/Support/DataTypes.h:35:0,
                 from /gnu/store/2ycqrc4r56r5ww8ja8x4gz25qsp65v65-llvm-3.7.1/include/llvm/Support/SwapByteOrder.h:19,
                 from /gnu/store/2ycqrc4r56r5ww8ja8x4gz25qsp65v65-llvm-3.7.1/include/llvm/Support/MathExtras.h:18,
                 from /gnu/store/2ycqrc4r56r5ww8ja8x4gz25qsp65v65-llvm-3.7.1/include/llvm/ADT/SmallVector.h:20,
                 from /gnu/store/2ycqrc4r56r5ww8ja8x4gz25qsp65v65-llvm-3.7.1/include/llvm/ADT/ArrayRef.h:14,
                 from /gnu/store/2ycqrc4r56r5ww8ja8x4gz25qsp65v65-llvm-3.7.1/include/llvm/ADT/APInt.h:19,
                 from /gnu/store/2ycqrc4r56r5ww8ja8x4gz25qsp65v65-llvm-3.7.1/include/llvm/ADT/APFloat.h:20,
                 from /tmp/guix-build-ldc-0.17.1.drv-0/ldc-0.17.1/dmd2/root/port.c:677:
/gnu/store/frrj3bfbmg5vrd0flh9cf8j64h7cr2v4-gcc-4.9.3/include/c++/cmath:632:5: note:   ?std::isnan?
     isnan(_Tp __x)
     ^
/tmp/guix-build-ldc-0.17.1.drv-0/ldc-0.17.1/dmd2/root/port.c: In static member function ?static int Port::isNan(longdouble)?:
/tmp/guix-build-ldc-0.17.1.drv-0/ldc-0.17.1/dmd2/root/port.c:789:19: error: ?isnan? was not declared in this scope
     return isnan(r);
                   ^
/tmp/guix-build-ldc-0.17.1.drv-0/ldc-0.17.1/dmd2/root/port.c:789:19: note: suggested alternative:
In file included from /gnu/store/2ycqrc4r56r5ww8ja8x4gz25qsp65v65-llvm-3.7.1/include/llvm/Support/DataTypes.h:35:0,
                 from /gnu/store/2ycqrc4r56r5ww8ja8x4gz25qsp65v65-llvm-3.7.1/include/llvm/Support/SwapByteOrder.h:19,
                 from /gnu/store/2ycqrc4r56r5ww8ja8x4gz25qsp65v65-llvm-3.7.1/include/llvm/Support/MathExtras.h:18,
                 from /gnu/store/2ycqrc4r56r5ww8ja8x4gz25qsp65v65-llvm-3.7.1/include/llvm/ADT/SmallVector.h:20,
                 from /gnu/store/2ycqrc4r56r5ww8ja8x4gz25qsp65v65-llvm-3.7.1/include/llvm/ADT/ArrayRef.h:14,
                 from /gnu/store/2ycqrc4r56r5ww8ja8x4gz25qsp65v65-llvm-3.7.1/include/llvm/ADT/APInt.h:19,
                 from /gnu/store/2ycqrc4r56r5ww8ja8x4gz25qsp65v65-llvm-3.7.1/include/llvm/ADT/APFloat.h:20,
                 from /tmp/guix-build-ldc-0.17.1.drv-0/ldc-0.17.1/dmd2/root/port.c:677:
/gnu/store/frrj3bfbmg5vrd0flh9cf8j64h7cr2v4-gcc-4.9.3/include/c++/cmath:632:5: note:   ?std::isnan?
     isnan(_Tp __x)
     ^
/tmp/guix-build-ldc-0.17.1.drv-0/ldc-0.17.1/dmd2/root/port.c: In static member function ?static int Port::isInfinity(double)?:
/tmp/guix-build-ldc-0.17.1.drv-0/ldc-0.17.1/dmd2/root/port.c:817:19: error: ?isinf? was not declared in this scope
     return isinf(r);
                   ^
/tmp/guix-build-ldc-0.17.1.drv-0/ldc-0.17.1/dmd2/root/port.c:817:19: note: suggested alternative:
In file included from /gnu/store/2ycqrc4r56r5ww8ja8x4gz25qsp65v65-llvm-3.7.1/include/llvm/Support/DataTypes.h:35:0,
                 from /gnu/store/2ycqrc4r56r5ww8ja8x4gz25qsp65v65-llvm-3.7.1/include/llvm/Support/SwapByteOrder.h:19,
                 from /gnu/store/2ycqrc4r56r5ww8ja8x4gz25qsp65v65-llvm-3.7.1/include/llvm/Support/MathExtras.h:18,
                 from /gnu/store/2ycqrc4r56r5ww8ja8x4gz25qsp65v65-llvm-3.7.1/include/llvm/ADT/SmallVector.h:20,
                 from /gnu/store/2ycqrc4r56r5ww8ja8x4gz25qsp65v65-llvm-3.7.1/include/llvm/ADT/ArrayRef.h:14,
                 from /gnu/store/2ycqrc4r56r5ww8ja8x4gz25qsp65v65-llvm-3.7.1/include/llvm/ADT/APInt.h:19,
                 from /gnu/store/2ycqrc4r56r5ww8ja8x4gz25qsp65v65-llvm-3.7.1/include/llvm/ADT/APFloat.h:20,
                 from /tmp/guix-build-ldc-0.17.1.drv-0/ldc-0.17.1/dmd2/root/port.c:677:
/gnu/store/frrj3bfbmg5vrd0flh9cf8j64h7cr2v4-gcc-4.9.3/include/c++/cmath:614:5: note:   ?std::isinf?
     isinf(_Tp __x)
     ^
make[2]: *** [CMakeFiles/LDCShared.dir/build.make:413: CMakeFiles/LDCShared.dir/dmd2/root/port.c.o] Error 1
make[2]: *** Waiting for unfinished jobs....
make[2]: Leaving directory '/tmp/guix-build-ldc-0.17.1.drv-0/build'
make[1]: *** [CMakeFiles/Makefile2:220: CMakeFiles/LDCShared.dir/all] Error 2
make[1]: Leaving directory '/tmp/guix-build-ldc-0.17.1.drv-0/build'
make: *** [Makefile:164: all] Error 2
phase `build' failed after 17.3 seconds
note: keeping build directory `/tmp/guix-build-ldc-0.17.1.drv-5'
builder for `/gnu/store/bzgm6da3bv9s6q6bm56ng7fsdhbxxpvr-ldc-0.17.1.drv' failed with exit code 1
@ build-failed /gnu/store/bzgm6da3bv9s6q6bm56ng7fsdhbxxpvr-ldc-0.17.1.drv - 1 builder for `/gnu/store/bzgm6da3bv9s6q6bm56ng7fsdhbxxpvr-ldc-0.17.1.drv' failed with exit code 1
guix build: error: build failed: build of `/gnu/store/bzgm6da3bv9s6q6bm56ng7fsdhbxxpvr-ldc-0.17.1.drv' failed
Danny Milosavljevic writes:

> This patch series fixes ldc up so it works again and updates it to the newest C++-bootstrappable version.
>
> Danny Milosavljevic (3):
>   gnu: ldc: make isnan and isinf work.
>   gnu: Add python-lit, python2-lit.
>   gnu: update ldc to 0.17.1.
>
>  gnu/packages/ldc.scm                               | 33 ++++++---
>  .../patches/ldc-0.17.1-disable-tests.patch         | 84 ++++++++++++++++++++++
>  gnu/packages/python.scm                            | 26 +++++++
>  3 files changed, 133 insertions(+), 10 deletions(-)
>  create mode 100644 gnu/packages/patches/ldc-0.17.1-disable-tests.patch

Thanks for your work!  I couldn't build the package.  I also had to
manually apply the patch.  I included the patch I used as well as the
build log.

It looks like there is still something wrong with 'isnan' and 'isinf'.

I tried both llvm (3.8) and llvm-3.7.

Could you verify that these patches work with the latest git version (of
GNU Guix) on your end?

Thanks!

Kind regards,
Roel Janssen
diff mbox

Patch

From 8fcf29cf7c2436e304eac9973f6c8d0f1d88010d Mon Sep 17 00:00:00 2001
From: Roel Janssen <roel@gnu.org>
Date: Tue, 6 Sep 2016 12:37:22 +0200
Subject: [PATCH] gnu: ldc: Upgrade to 0.17.1.

* gnu/packages/ldc.scm (ldc): Upgrade to 0.17.1.
---
 gnu/packages/ldc.scm | 32 +++++++++++++++++++++++---------
 1 file changed, 23 insertions(+), 9 deletions(-)

diff --git a/gnu/packages/ldc.scm b/gnu/packages/ldc.scm
index 1709f59..c2a62c0 100644
--- a/gnu/packages/ldc.scm
+++ b/gnu/packages/ldc.scm
@@ -26,8 +26,10 @@ 
   #:use-module (guix build-system cmake)
   #:use-module (gnu packages)
   #:use-module (gnu packages base)
+  #:use-module (gnu packages compression)
   #:use-module (gnu packages libedit)
   #:use-module (gnu packages llvm)
+  #:use-module (gnu packages python)
   #:use-module (gnu packages textutils)
   #:use-module (gnu packages zip))
 
@@ -75,7 +77,7 @@  and freshness without requiring additional information from the user.")
 (define-public ldc
   (package
     (name "ldc")
-    (version "0.16.1")
+    (version "0.17.1")
     (source (origin
               (method url-fetch)
               (uri (string-append
@@ -84,7 +86,7 @@  and freshness without requiring additional information from the user.")
               (file-name (string-append name "-" version ".tar.gz"))
               (sha256
                (base32
-                "1jvilxx0rpqmkbja4m69fhd5g09697xq7vyqp2hz4hvxmmmv4j40"))))
+                "0rwggnbr60jbajfdw11kx058llmwljiss8rrv8df07vaygiv845i"))))
     (build-system cmake-build-system)
     ;; LDC currently only supports the x86_64 and i686 architectures.
     (supported-systems '("x86_64-linux" "i686-linux"))
@@ -101,6 +103,15 @@  and freshness without requiring additional information from the user.")
                (and (unpack "phobos-src" "runtime/phobos")
                     (unpack "druntime-src" "runtime/druntime")
                     (unpack "dmd-testsuite-src" "tests/d2/dmd-testsuite")))))
+         (add-after 'unpack-submodule-sources 'patch-dmd2
+           (lambda* (#:key inputs #:allow-other-keys)
+             (substitute* "dmd2/root/port.c"
+               ((" ::isnan") " isnan")
+               ((" ::isinf") " isinf"))
+             #t))
+         (add-before 'check 'prepare-unittests
+           (lambda* (#:key inputs #:allow-other-keys)
+             (zero? (system* "ctest" "--verbose" "-R" "build-phobos2-ldc-unittest"))))
          (add-after 'unpack-submodule-sources 'patch-phobos
            (lambda* (#:key inputs #:allow-other-keys)
              (substitute* "runtime/phobos/std/process.d"
@@ -115,11 +126,14 @@  and freshness without requiring additional information from the user.")
     (inputs
      `(("libconfig" ,libconfig)
        ("libedit" ,libedit)
-       ("tzdata" ,tzdata)))
+       ("tzdata" ,tzdata)
+       ("zlib" ,zlib)))
     (native-inputs
-     `(("llvm" ,llvm)
-       ("clang" ,clang)
+     `(("llvm" ,llvm-3.7)
+       ("clang" ,clang-3.7)
        ("unzip" ,unzip)
+       ("python-wrapper" ,python-wrapper) ; Needed for running tests
+       ("python-lit" ,python-lit) ; Needed for running tests
        ("phobos-src"
         ,(origin
            (method url-fetch)
@@ -128,8 +142,8 @@  and freshness without requiring additional information from the user.")
                  version ".tar.gz"))
            (sha256
             (base32
-             "0sgdj0536c4nb118yiw1f8lqy5d3g3lpg9l99l165lk9xy45l9z4"))
-           (patches (search-patches "ldc-disable-tests.patch"))))
+             "17nb1yvqblqj3q42c8nlnwvy823fw6kna28n2b48j4m6kd2w0nan"))
+           (patches (search-patches "ldc-0.17.1-disable-tests.patch"))))
        ("druntime-src"
         ,(origin
            (method url-fetch)
@@ -138,7 +152,7 @@  and freshness without requiring additional information from the user.")
                  version ".tar.gz"))
            (sha256
             (base32
-             "0z4mkyddx6c4sy1vqgqvavz55083dsxws681qkh93jh1rpby9yg6"))))
+             "129j7mfd0vnzaw7i6hr5waxm5cb0qcm8gyawy2xy5avlv8hrw5m4"))))
        ("dmd-testsuite-src"
         ,(origin
            (method url-fetch)
@@ -147,7 +161,7 @@  and freshness without requiring additional information from the user.")
                  version ".tar.gz"))
            (sha256
             (base32
-             "0yc6miidzgl9k33ygk7xcppmfd6kivqj02cvv4fmkbs3qz4yy3z1"))))))
+             "18h16lwwmr3k9dh7mcip17il72mz680wnygv9d0mdnivczn80zyv"))))))
     (home-page "http://wiki.dlang.org/LDC")
     (synopsis "LLVM compiler for the D programming language")
     (description
-- 
2.10.0